program: Gaussian 09
title: 000292851
version: EM64L-G09RevD.01
frameworkgroup: C1[X(C11H24S)]
method: RPBEPBE
basis: SDD
operation: Freq
keyword: #pfreq=noraman
keyword: PBEPBE/SDD
title: #p freq=noraman PBEPBE/SDD
converged: YES YES NO NO
title: Mulliken charges:
elementType: S C C C C C C C C C C C H H H H H H H H H H H H H H H H H H H H H H H H
charge: 0.132912 -0.382452 -0.368624 -0.371031 -0.355965 -0.353435 -0.378006 -0.356269 -0.661197 -0.696627 -0.579095 -0.657355 0.190231 0.194969 0.192870 0.185425 0.187568 0.189716 0.216027 0.186384 0.188674 0.187178 0.204236 0.217321 0.194946 0.194157 0.251622 0.246274 0.209456 0.214592 0.210001 0.244941 0.244872 0.229536 0.229011 0.217137
chargesum: 0.00000
title: Mulliken charges with hydrogens summed into heavy atoms:
elementType: S C C C C C C C C C C C
charge: 0.132912 0.002747 0.009672 0.006254 0.046445 0.022417 0.043551 0.032834 -0.163301 -0.062577 -0.089282 0.018328
polarizability: 1.84621666e+02 -8.08585106e+00 1.25379156e+02 2.56724221e+00 1.96792636e+00 1.09085814e+02
1716.lowfreq: -23.4266 -6.1730 -3.5538 -0.0024 -0.0024 -0.0013 18.7037 25.3734 35.1641
frequency: 9.7312 25.0312 34.9417 44.3156 56.9194 67.7774 81.6171 95.7699 124.3821 134.4845 140.0502 159.7136 206.7334 218.9130 238.8833 275.9201 295.0993 323.1100 409.1461 446.6729 495.0269 627.0964 639.9879 719.0251 723.9040 742.1359 783.5712 789.4966 831.9911 866.2093 886.7278 930.1900 973.7053 996.0604 997.8159 1005.7279 1029.6511 1038.7771 1045.6147 1062.9249 1068.0889 1079.5226 1081.1563 1102.7576 1118.1789 1175.6662 1187.7325 1216.0825 1227.6877 1241.3896 1247.6641 1261.1622 1266.9403 1279.3554 1282.0388 1288.4009 1290.2618 1297.0053 1308.7149 1328.7557 1349.2304 1352.8370 1357.7283 1387.9629 1395.0564 1447.8209 1452.9612 1459.6438 1461.0263 1461.2486 1464.7300 1470.0918 1470.3532 1475.5511 1476.6898 1483.0640 1484.3975 1487.6167 2946.8330 2948.8182 2951.0774 2957.4924 2959.3965 2965.9069 2967.8435 2970.7353 2982.4039 2984.0910 2988.5720 2991.2520 2999.5305 3001.3258 3010.0333 3020.4315 3034.0803 3044.1679 3060.6364 3064.4561 3067.1482 3069.4611 3078.0414 3095.2628
redmass: 1.7151 3.5650 3.0692 4.1166 2.2245 2.1641 2.0312 3.0996 1.8453 2.9775 2.5620 3.0740 2.3679 1.1228 1.1037 2.9288 3.4804 3.3504 2.8305 3.3338 2.7828 4.4399 3.4615 1.0624 1.0870 1.1509 1.2375 1.1268 1.4005 1.3492 1.9024 1.2971 2.3792 3.4379 1.8187 1.2877 1.3908 1.9300 2.9922 1.8067 1.8360 2.1622 2.1809 1.8137 2.3267 1.5501 1.5890 1.4116 1.3378 1.2391 1.3010 1.2864 1.2514 1.0342 1.1686 1.0940 1.1204 1.3143 1.2024 1.4116 1.5523 1.6999 1.6219 1.2167 1.2066 1.0899 1.0778 1.0743 1.0866 1.0687 1.0759 1.0792 1.0395 1.0430 1.0804 1.0891 1.0479 1.0902 1.0590 1.0589 1.0593 1.0596 1.0602 1.0612 1.0603 1.0365 1.0961 1.0355 1.0978 1.0585 1.0996 1.0570 1.0983 1.1035 1.1044 1.1041 1.1068 1.1072 1.1007 1.0993 1.0988 1.1030
irintensity: 0.0407 0.1017 2.5946 0.6028 0.0242 0.1218 0.3311 0.1168 0.0397 0.2304 0.0898 0.0548 0.3681 0.0009 0.0465 0.4204 0.2396 1.7728 0.3735 0.2684 0.3772 4.5673 0.4953 15.1128 0.3739 4.8235 2.3160 7.9864 8.5269 2.6058 4.9913 1.4891 2.0424 0.6683 15.6928 0.5356 1.1182 4.3483 0.8061 2.5887 0.3328 0.8697 0.4612 4.2628 10.5807 3.6704 3.6956 7.5346 0.2886 0.8090 14.8705 6.9132 12.2273 1.7804 5.9291 0.4643 1.3383 1.1466 6.7695 0.1999 0.9096 0.4141 2.7333 11.3345 17.6789 11.7742 2.6772 0.0441 3.0946 0.2651 0.4297 1.8680 14.5131 12.2544 2.4900 5.1350 7.5201 27.1629 1.8202 1.8384 0.1318 22.2205 1.3636 3.0814 219.1234 39.2231 2.8184 39.4012 2.9075 37.1099 4.5571 30.5324 4.5488 2.0225 26.8787 166.7397 38.9679 20.7092 101.5434 56.6062 33.7852 49.3970
temp: 298.150 k
press: 1.00000 atm
elementType: 16 6 6 6 6 6 6 6 6 6 6 6 1 1 1 1 1 1 1 1 1 1 1 1 1 1 1 1 1 1 1 1 1 1 1 1
symmnumber: 1
zpe: 855452.1 jmol-1
zpe.correction: 0.325824 hartree
zpe.thermalcorrener: 0.343321 hartree
zpe.thermalcorrenthalpy: 0.344265 hartree
zpe.thermalcorrgfe: 0.275870 hartree
zpe.sumelectzpe: -830.603353 hartree
zpe.sumelectthermal: -830.585856 hartree
zpe.sumelectthermalent: -830.584912 hartree
zpe.sumelectthermalfe: -830.653307 hartree
dipole: 0.7483 1.1948 0.9344
dipole: 1.6913
quadrupole: -78.3687 -85.4956 -86.2672
quadrupole: 1.9895 3.9526 0.8518
quadrupole: 5.0085 -2.1184 -2.8900 1.9895 3.9526 0.8518
hfenergy: -830.929177 hartree
pointgroup: C01 [X(C11H24S1)]
dipole: -0.3006289 -0.4421786 0.3960912 debye
polarizability: 184.4662527|-8.8212865|125.2269589|-1.7369894|-3.0265985|109.3934233 unknown
InChI: InChI=1S/C11H24S/c1-3-5-6-7-8-9-10-11-12-4-2/h3-11H2,1-2H3
charge 0 multiplicity 1
36 atoms
S  -3.917163 0.49191 -0.396989
C  1.716827 0.048658 0.224518
C  0.5972 -0.951186 -0.142462
C  3.124179 -0.427706 -0.201176
C  -0.808067 -0.485318 0.299814
C  4.246513 0.570352 0.162698
C  -1.915706 -1.495357 -0.078077
C  5.654173 0.087518 -0.2563
C  -3.320225 -1.115892 0.422439
C  6.770418 1.089018 0.111436
C  -5.694927 0.492578 0.264336
C  -6.428183 1.746963 -0.232763
H  1.70607 0.225134 1.320616
H  1.502126 1.029161 -0.249364
H  0.599836 -1.116497 -1.240366
H  0.820197 -1.935937 0.320393
H  3.337938 -1.407959 0.274774
H  3.134284 -0.606498 -1.296986
H  -1.033587 0.499395 -0.155536
H  -0.816378 -0.328383 1.39882
H  4.038116 1.549333 -0.317775
H  4.23468 0.753913 1.257725
H  -1.660016 -2.487255 0.350605
H  -1.942187 -1.626391 -1.178378
H  5.665035 -0.095622 -1.350339
H  5.860469 -0.890983 0.223983
H  -4.052854 -1.90324 0.167203
H  -3.322869 -0.962215 1.517369
H  6.799582 1.265883 1.203373
H  7.76585 0.720115 -0.197835
H  6.603906 2.065928 -0.380814
H  -5.647674 0.469437 1.367805
H  -6.190644 -0.428538 -0.091343
H  -5.927497 2.666109 0.119971
H  -6.463205 1.776946 -1.336429
H  -7.468216 1.756827 0.143156
