program: Gaussian 09
title: 000292866
version: EM64L-G09RevD.01
frameworkgroup: C1[X(C17H14ClNO2)]
method: RPBEPBE
basis: SDD
operation: Freq
keyword: #p
keyword: freq=noraman
keyword: PBEPBE/SDD
title: #p freq=noraman PBEPBE/SDD
converged: YES YES NO NO
title: Mulliken charges:
elementType: Cl O O N C C C C C C C C C C C C C C C C C H H H H H H H H H H H H H H
charge: -0.048327 -0.253138 -0.248850 -0.436846 0.518866 0.479474 -0.380598 -0.384769 -0.358443 -0.463665 -0.286715 0.307536 -0.309532 0.097941 -0.328678 -0.341915 -0.229257 -0.223332 -0.103460 0.216439 -0.798048 0.228033 0.241519 0.310564 0.222700 0.272586 0.207347 0.313558 0.225137 0.286268 0.257276 0.259159 0.239620 0.272348 0.239203
chargesum: 0.00000
title: Mulliken charges with hydrogens summed into heavy atoms:
elementType: Cl O O N C C C C C C C C C C C C C C C C C
charge: -0.048327 -0.253138 -0.248850 -0.123288 0.518866 0.479474 -0.152565 -0.143251 -0.047879 -0.240965 -0.014129 0.307536 -0.102184 0.097941 -0.103541 -0.055646 0.028019 0.035827 -0.103460 0.216439 -0.046877
polarizability: 5.08692203e+02 -2.60468723e+00 2.19026081e+02 1.99403946e+00 -7.43503788e-01 8.35728192e+01
1716.lowfreq: -73.8995 -0.0015 0.0002 0.0008 1.6451 2.8720 6.8024 13.4700 23.1738
frequency: -73.8991 12.7390 23.1589 31.8007 44.5152 70.8149 83.8953 105.5828 111.7660 140.9109 169.4596 179.9756 222.9478 250.3748 271.2073 302.3328 321.6462 342.9899 377.8551 391.9160 406.1606 414.0622 472.6972 493.2957 506.8350 523.0769 533.7827 580.9686 621.9504 623.2913 638.1847 651.1952 666.7582 697.6564 727.0467 752.8646 777.3077 823.2151 826.7706 829.5938 849.9577 862.3089 880.8832 886.3292 928.9581 953.4226 957.7340 983.6953 995.6519 996.4183 998.1464 1005.7560 1015.0801 1031.5727 1032.2047 1072.3496 1109.2741 1126.3996 1182.0746 1192.1064 1217.4387 1219.9307 1225.3828 1271.6242 1286.6175 1303.5409 1326.7704 1334.9932 1369.0543 1373.3213 1377.0842 1396.4886 1426.5576 1448.1328 1467.6848 1474.0275 1491.0626 1508.6186 1517.1606 1577.3253 1580.9825 1593.3735 1618.7425 1635.7455 1639.0337 2987.9614 3072.8420 3094.5576 3112.9822 3138.0083 3140.6881 3144.4284 3147.2217 3154.8821 3158.0405 3173.0703 3177.3359 3196.7726 3517.2077
redmass: 1.0492 3.9278 4.7568 7.7808 5.5749 5.2682 6.9683 5.1213 6.2913 3.4084 8.0502 5.8294 3.5712 6.9929 5.7656 8.4690 6.4032 4.1586 3.7279 5.7799 2.8557 2.8943 3.3050 6.1256 5.5132 2.4388 4.7616 2.9049 6.3292 6.7099 6.3875 1.1870 3.8554 7.2367 3.0730 3.2716 5.7837 1.3811 4.8954 1.4021 1.3941 1.5897 4.4311 1.9803 6.5986 1.3738 1.3852 1.7053 3.1409 1.5607 1.3327 2.6166 1.2381 1.6667 3.4264 2.7445 1.3765 1.3984 1.1585 1.1524 2.7826 2.9731 1.5135 1.9211 1.3111 1.6403 1.6077 2.2166 3.7602 3.9977 1.2491 4.0272 3.6237 1.1942 1.0466 2.3669 1.9296 4.8997 4.0978 5.4707 6.2875 6.1462 5.6368 5.5596 5.3961 1.0385 1.0983 1.0892 1.0884 1.0979 1.0919 1.0946 1.0901 1.0885 1.0874 1.0963 1.0971 1.0948 1.0764
irintensity: 0.0372 1.0319 4.2917 0.4125 0.0234 10.1446 0.4986 0.9673 3.7846 0.2722 0.4868 0.8944 0.7404 6.9197 0.8955 1.1132 14.8338 7.7008 0.0541 6.3974 0.1177 0.0036 8.4105 27.0630 11.3453 44.4949 2.2953 1.2229 23.8757 1.9858 10.1343 60.3769 4.9756 3.3939 0.9661 6.0004 31.8114 53.8191 1.8098 30.4016 71.3364 17.4106 10.2676 0.0765 9.3198 3.6478 2.0615 51.8276 86.8301 18.4935 11.1467 2.3386 33.7259 8.5194 95.0976 82.6362 25.1038 10.8716 143.2430 63.5604 38.0825 369.9167 12.7866 80.2330 9.9432 115.7355 37.7139 53.2075 253.8446 278.5335 107.9561 22.9339 110.2223 32.1045 20.6649 23.3206 122.5840 679.5543 68.6371 218.9287 0.2816 226.6909 266.5399 230.4976 61.9569 7.8041 13.8018 1.0755 24.4304 6.7595 10.0975 11.5360 4.9352 0.4182 13.7659 10.7891 4.0263 4.3929 19.2228
temp: 298.150 k
press: 1.00000 atm
elementType: 17 8 8 7 6 6 6 6 6 6 6 6 6 6 6 6 6 6 6 6 6 1 1 1 1 1 1 1 1 1 1 1 1 1 1
symmnumber: 1
zpe: 693712.2 jmol-1
zpe.correction: 0.264221 hartree
zpe.thermalcorrener: 0.282877 hartree
zpe.thermalcorrenthalpy: 0.283821 hartree
zpe.thermalcorrgfe: 0.213410 hartree
zpe.sumelectzpe: -1320.012369 hartree
zpe.sumelectthermal: -1319.993713 hartree
zpe.sumelectthermalent: -1319.992769 hartree
zpe.sumelectthermalfe: -1320.063180 hartree
dipole: 6.4254 0.9302 0.1193
dipole: 6.4935
quadrupole: -94.3524 -136.1321 -134.8268
quadrupole: 18.6910 1.1644 -0.5105
quadrupole: 27.4181 -14.3617 -13.0564 18.6910 1.1644 -0.5105
hfenergy: -1320.2765902 hartree
pointgroup: C01 [X(C17H14Cl1N1O2)]
dipole: 2.5151888 -0.4468721 0.0283307 debye
polarizability: 508.534475|-6.3896887|217.8643621|4.3186413|-13.2169863|84.8922662 unknown
InChI: InChI=1S/C17H14ClNO2/c1-12(20)19-16-9-2-13(3-10-16)4-11-17(21)14-5-7-15(18)8-6-14/h2-11,19H,1H3
charge 0 multiplicity 1
35 atoms
Cl -7.551731 2.147244 -0.274385
O  -2.578552 -2.492609 0.233923
O  5.619671 2.392685 -0.055512
N  5.598271 0.047124 0.093486
C  1.440387 -0.972108 0.123846
C  4.209905 -0.243268 0.101062
C  1.850167 0.392402 0.047545
C  2.464702 -1.962493 0.189306
C  3.203285 0.763933 0.03545
C  3.822443 -1.610246 0.178571
C  0.043107 -1.40158 0.139342
C  -3.648303 -0.346671 0.016001
C  -1.080528 -0.614558 0.078841
C  -2.428785 -1.228475 0.11556
C  -3.597939 1.055935 -0.209155
C  -4.92036 -0.968766 0.14727
C  -4.781322 1.819556 -0.300518
C  -6.110946 -0.223126 0.062296
C  -6.021279 1.166794 -0.161067
C  6.239123 1.294023 0.018404
C  7.76425 1.198314 0.03455
H  1.095126 1.184391 -0.00252
H  2.181323 -3.019831 0.249262
H  3.503628 1.811134 -0.023733
H  4.588769 -2.394402 0.230032
H  -0.140533 -2.484555 0.208263
H  -0.995897 0.474354 0.011817
H  6.215063 -0.76778 0.14872
H  -2.642236 1.574966 -0.326096
H  -4.944986 -2.050237 0.315251
H  -4.740776 2.897904 -0.477599
H  -7.086829 -0.705831 0.166487
H  8.127765 0.726636 0.966408
H  8.17926 2.213872 -0.031541
H  8.139551 0.605471 -0.820268
