program: Gaussian 09
title: 000292857
version: EM64L-G09RevD.01
frameworkgroup: C1[X(C17H18O)]
method: RPBEPBE
basis: SDD
operation: Freq
keyword: #pfreq=noraman
keyword: PBEPBE/SDD
title: #p freq=noraman PBEPBE/SDD
converged: YES YES NO NO
title: Mulliken charges:
elementType: O C C C C C C C C C C C C C C C C C H H H H H H H H H H H H H H H H H H
charge: -0.224727 -0.353995 -0.056859 0.505416 0.084759 -0.726861 -0.720351 0.309456 -0.447313 -0.384778 -0.231675 -0.235457 -0.345191 -0.357146 -0.244979 -0.253578 -0.232854 -0.226124 0.213593 0.235766 0.216029 0.198817 0.244846 0.215158 0.239962 0.197344 0.226447 0.267706 0.224833 0.225616 0.234628 0.277231 0.228360 0.230086 0.232806 0.233029
chargesum: 0.00000
title: Mulliken charges with hydrogens summed into heavy atoms:
elementType: O C C C C C C C C C C C C C C C C C
charge: -0.224727 -0.140402 0.178907 0.505416 0.084759 -0.067169 -0.067888 0.309456 -0.220866 -0.117072 -0.006842 -0.009840 -0.110563 -0.079915 -0.016620 -0.023492 -0.000049 0.006905
polarizability: 2.09999085e+02 6.10391276e+00 1.69977954e+02 -3.35892005e+00 1.87566587e+01 1.62291320e+02
1716.lowfreq: -8.3993 -6.8151 -0.0003 -0.0001 0.0004 3.6944 22.1575 24.4334 53.0487
frequency: 22.0699 23.8164 52.9993 57.7418 82.9295 110.8913 143.4435 155.4745 194.4228 208.9987 231.6758 244.7315 280.0993 321.8338 331.5867 397.8412 405.3633 407.1615 412.4630 430.3578 475.3270 517.6946 581.8576 613.1823 615.3535 653.0684 688.8749 696.9105 707.6637 756.4776 772.2970 815.9992 834.9852 852.8266 857.6754 861.2163 920.0863 925.5863 935.4287 941.3242 958.1676 979.7087 987.4909 989.0705 990.6675 996.3733 1003.5751 1009.5610 1027.2848 1029.0875 1077.5256 1086.5569 1125.6706 1126.7597 1171.3128 1172.1368 1173.1568 1185.0433 1189.3864 1192.1959 1216.3695 1247.9612 1283.7233 1306.7486 1315.8728 1332.1251 1344.4063 1379.6619 1381.8075 1387.1874 1397.3057 1435.1985 1440.9745 1466.2674 1470.1283 1478.2305 1479.5282 1481.7350 1490.7023 1559.1193 1590.4726 1594.2545 1607.5386 1611.1691 2968.2707 2972.4096 2996.3954 3013.0029 3056.5382 3066.9188 3082.8044 3087.1094 3108.9988 3123.7661 3128.4001 3134.8524 3139.5830 3145.4091 3152.1611 3161.4985 3162.3298 3170.7291
redmass: 5.3083 3.7123 3.1272 3.0747 3.8987 3.7639 6.4337 4.4146 1.8208 1.6179 1.1942 4.0880 2.8803 3.4359 5.3740 2.7755 2.8894 3.3113 2.6508 3.0634 4.7807 3.3667 4.9195 6.4136 6.4231 6.0761 4.0167 1.7573 1.7428 2.1238 2.2833 3.3040 2.9711 1.2707 1.2511 2.7524 1.1744 1.5019 2.2080 1.4731 1.4936 1.4125 1.5052 5.3349 4.3212 1.5508 2.2374 1.4063 2.1653 2.0284 1.6569 1.5981 2.0949 2.1784 1.2793 1.3057 1.1697 1.7832 1.1784 1.2320 2.3845 1.6458 1.7541 1.4341 1.3421 1.3247 1.2718 1.3792 4.2157 9.0571 1.2183 2.2654 2.1608 1.0554 1.0507 2.1661 2.1116 1.0803 1.0485 7.7675 6.0443 6.3448 5.9794 6.3515 1.0377 1.0383 1.0808 1.0844 1.0979 1.0973 1.0991 1.0986 1.0877 1.0858 1.0852 1.0912 1.0885 1.0958 1.0926 1.0957 1.1013 1.1004
irintensity: 1.3119 0.0837 0.0317 0.0113 0.8199 0.8225 2.8556 0.0427 0.3412 0.5717 0.0414 4.3042 0.5583 0.0964 5.9495 0.1255 0.0176 0.0223 1.6164 0.3454 0.6097 16.4692 13.7977 0.0185 0.1807 20.5041 3.9037 61.9613 54.7864 46.2979 42.8150 5.2394 2.7004 0.1245 0.5434 2.8773 7.3590 3.4016 22.7229 3.8470 0.2508 0.0532 0.3425 3.4493 0.6487 4.6739 20.9606 4.7885 5.5812 4.2731 8.6869 10.7726 3.2214 5.7231 18.7146 13.1249 3.1827 30.4030 7.3881 1.9709 76.1521 62.5730 76.6978 1.2270 1.1126 18.8680 15.4869 12.6812 1.7545 2.6031 19.1171 20.7308 9.2810 3.1487 6.9206 9.6785 9.2593 7.8047 26.0689 108.3848 2.6440 16.2411 15.2456 4.1124 24.6999 39.2957 5.4469 16.5107 3.4655 81.8347 27.8691 37.8174 12.5020 0.0954 0.1656 14.4968 7.9905 26.3645 16.4594 31.1831 24.1054 16.1289
temp: 298.150 k
press: 1.00000 atm
elementType: 8 6 6 6 6 6 6 6 6 6 6 6 6 6 6 6 6 6 1 1 1 1 1 1 1 1 1 1 1 1 1 1 1 1 1 1
symmnumber: 1
zpe: 783435.2 jmol-1
zpe.correction: 0.298395 hartree
zpe.thermalcorrener: 0.315135 hartree
zpe.thermalcorrenthalpy: 0.316079 hartree
zpe.thermalcorrgfe: 0.252262 hartree
zpe.sumelectzpe: -732.543094 hartree
zpe.sumelectthermal: -732.526354 hartree
zpe.sumelectthermalent: -732.525410 hartree
zpe.sumelectthermalfe: -732.589226 hartree
dipole: 0.7272 -1.5447 -2.3053
dipole: 2.8687
quadrupole: -96.4461 -106.0334 -103.8317
quadrupole: -0.7287 -1.7099 0.4813
quadrupole: 5.6576 -3.9296 -1.7280 -0.7287 -1.7099 0.4813
hfenergy: -732.8414889 hartree
pointgroup: C01 [X(C17H18O1)]
dipole: -0.2685586 0.7102234 -0.8350351 debye
polarizability: 210.4545403|-2.3774266|171.8117443|-4.7804768|-18.2103638|160.0020741 unknown
InChI: InChI=1S/C17H18O/c1-13(2)16(14-9-5-3-6-10-14)17(18)15-11-7-4-8-12-15/h3-13,16H,1-2H3
charge 0 multiplicity 1
36 atoms
O  -0.643998 -1.52383 1.692397
C  0.383778 -1.057051 -0.471767
C  0.973116 -2.508094 -0.455721
C  1.450962 0.021227 -0.222888
C  -0.724076 -0.893897 0.594456
C  -0.121863 -3.546127 -0.799635
C  2.164832 -2.639387 -1.430626
C  -1.876244 0.039458 0.343579
C  1.855762 0.8924 -1.26551
C  2.071266 0.144432 1.048191
C  2.860429 1.862633 -1.050086
C  3.075604 1.113086 1.265345
C  -1.945142 0.900016 -0.785347
C  -2.935304 0.062729 1.293404
C  3.474575 1.976635 0.218221
C  -3.049932 1.760278 -0.960893
C  -4.040813 0.915911 1.114296
C  -4.101707 1.768128 -0.015552
H  -0.050417 -0.890691 -1.476813
H  1.324262 -2.705298 0.575795
H  0.299105 -4.568279 -0.786002
H  -0.532449 -3.367236 -1.813086
H  -0.954102 -3.516871 -0.075259
H  2.563243 -3.670542 -1.40856
H  2.98732 -1.949546 -1.173788
H  1.852014 -2.423999 -2.471562
H  1.393289 0.801661 -2.25694
H  1.757834 -0.514424 1.866435
H  3.163899 2.525155 -1.868746
H  3.544518 1.197396 2.25237
H  -1.133322 0.918872 -1.51855
H  -2.860306 -0.600504 2.161512
H  4.252519 2.729198 0.389042
H  -3.09091 2.425387 -1.830345
H  -4.853435 0.921646 1.848981
H  -4.960603 2.434125 -0.155746
