program: Gaussian 09
title: 000292828
version: EM64L-G09RevD.01
frameworkgroup: C1[X(C12H24O2)]
method: RPBEPBE
basis: SDD
operation: Freq
keyword: #pfreq=noraman
keyword: PBEPBE/SDD
title: #p freq=noraman PBEPBE/SDD
converged: YES YES NO NO
title: Mulliken charges:
elementType: O O C C C C C C C C C C C C H H H H H H H H H H H H H H H H H H H H H H H H
charge: -0.418601 -0.240137 -0.098591 -0.461796 -0.065994 -0.386711 -0.381786 -0.375657 -0.354305 -0.715596 -0.722386 0.127572 -0.356756 -0.696680 0.235290 0.199752 0.236014 0.205489 0.192396 0.209549 0.190713 0.197219 0.189901 0.191984 0.187513 0.189238 0.212677 0.219796 0.221213 0.227886 0.205077 0.242226 0.194713 0.195461 0.210225 0.209384 0.215116 0.368589
chargesum: 0.00000
title: Mulliken charges with hydrogens summed into heavy atoms:
elementType: O O C C C C C C C C C C C C
charge: -0.050011 -0.240137 0.136699 -0.026031 0.139495 0.015234 0.006147 0.006229 0.022446 -0.061911 -0.047197 0.127572 0.033419 -0.061955
polarizability: 1.63457411e+02 -2.45635231e-01 1.27903550e+02 -3.28999734e+00 -1.81081961e+00 1.19099818e+02
1716.lowfreq: -16.4655 -8.7786 -0.0009 -0.0008 0.0005 4.2490 22.2345 34.5861 36.8295
frequency: 21.0651 34.0204 36.7922 44.0047 66.1172 77.9966 91.1066 122.8300 132.1950 138.1099 149.1159 199.5831 218.2688 226.3436 229.3407 239.9205 254.1985 320.3870 348.7654 371.2148 419.7229 450.3033 471.4226 514.8484 606.3439 629.9591 704.0225 720.0883 729.2376 754.6701 788.4049 816.2537 853.0636 888.3653 916.6245 921.7479 947.4201 956.6554 989.5424 997.1997 1026.1744 1031.7026 1043.9825 1060.0613 1074.8158 1081.0604 1098.9328 1112.5550 1134.0163 1147.3294 1182.0745 1190.6890 1219.7973 1230.5128 1239.4296 1252.7088 1272.0875 1278.2310 1282.8218 1291.2405 1293.8169 1297.8730 1313.5574 1329.6574 1344.3910 1354.5146 1356.2452 1380.0786 1386.6206 1388.0298 1402.9162 1455.7208 1460.5417 1462.4767 1466.8220 1467.5475 1470.3138 1475.1000 1476.4620 1482.4434 1483.1169 1488.1864 1488.5276 1651.6199 2950.6902 2951.2726 2955.7015 2960.6267 2961.4867 2968.0524 2971.5326 2976.6234 2976.8268 2984.4258 2984.9012 2993.3417 3006.0398 3012.3230 3022.4228 3036.9218 3053.1499 3067.6999 3070.4216 3071.2278 3075.2081 3078.0511 3087.2986 3494.7779
redmass: 2.9549 2.0396 5.0501 3.3888 3.2457 3.2150 1.6754 2.8726 2.7870 1.9647 3.4232 2.3917 1.2572 1.2032 2.4897 1.1457 2.8475 3.1920 2.8437 3.1366 2.8148 2.9336 2.8703 3.3348 2.1034 1.6578 2.7457 1.0679 1.1416 1.3553 2.0725 2.0835 1.5949 1.8948 1.2306 1.2571 2.3889 1.4179 3.4697 1.3380 2.8180 3.1262 2.7621 1.6404 2.4524 2.1534 2.0280 2.0990 1.7804 2.4840 2.0686 1.7060 1.2954 1.4351 1.4595 1.2609 1.2536 1.3822 1.0324 1.3109 1.1212 1.1066 1.3735 1.4129 1.4521 1.6567 1.5985 1.5658 1.2469 1.2165 1.2158 1.0749 1.0755 1.0700 1.0462 1.0750 1.0564 1.0777 1.0436 1.0727 1.0603 1.0540 1.0847 7.6905 1.0586 1.0587 1.0591 1.0826 1.0601 1.0586 1.0366 1.0588 1.0396 1.0902 1.0415 1.0978 1.0997 1.0869 1.1027 1.1039 1.1019 1.1007 1.0993 1.0998 1.0995 1.0993 1.0993 1.0637
irintensity: 0.0992 0.3376 1.1976 0.1480 0.5231 0.2665 0.0152 0.0953 0.1059 0.0061 0.1561 0.2426 0.0549 0.0393 0.2926 0.3008 2.2498 1.0216 0.8485 2.3730 1.1527 8.0645 3.5247 18.1026 47.1409 73.0204 41.8268 14.2174 1.7522 6.1245 3.0451 1.7794 0.6270 4.2784 1.7864 3.4640 8.8472 0.1303 5.0919 0.3237 21.9166 114.1455 111.6247 12.0416 0.7126 0.0983 0.4739 24.6711 9.1334 11.3502 14.2775 1.1972 9.6845 1.4647 2.7946 3.8673 0.9113 11.1659 0.7961 6.5586 0.1380 1.0226 1.0226 2.7457 0.7151 1.2098 1.0236 27.2835 16.0364 11.7098 18.8062 3.5643 0.4918 1.1226 3.4279 3.3304 2.0983 1.8587 12.1669 6.2222 8.5395 7.6506 33.0769 165.5117 0.2883 0.2724 1.4865 23.3867 28.7841 122.5803 35.6182 33.5420 46.4653 1.3099 31.8373 2.0194 2.5826 9.4145 1.1377 84.4800 74.7012 96.5025 55.3958 14.7494 42.7041 61.9949 37.4843 17.1580
temp: 298.150 k
press: 1.00000 atm
elementType: 8 8 6 6 6 6 6 6 6 6 6 6 6 6 1 1 1 1 1 1 1 1 1 1 1 1 1 1 1 1 1 1 1 1 1 1 1 1
symmnumber: 1
zpe: 888437.2 jmol-1
zpe.correction: 0.338388 hartree
zpe.thermalcorrener: 0.356761 hartree
zpe.thermalcorrenthalpy: 0.357705 hartree
zpe.thermalcorrgfe: 0.289445 hartree
zpe.sumelectzpe: -620.973285 hartree
zpe.sumelectthermal: -620.954911 hartree
zpe.sumelectthermalent: -620.953967 hartree
zpe.sumelectthermalfe: -621.022228 hartree
dipole: 0.1052 -0.3447 -1.4666
dipole: 1.5103
quadrupole: -87.8315 -84.2399 -94.3487
quadrupole: -0.0337 -2.3690 1.1794
quadrupole: 0.9752 4.5668 -5.5420 -0.0337 -2.3690 1.1794
hfenergy: -621.3116725 hartree
pointgroup: C01 [X(C12H24O2)]
dipole: 0.0459977 -0.1704213 -0.5673536 debye
polarizability: 163.5073855|-0.4198206|127.6512196|-2.9127267|-2.3354709|119.3021745 unknown
InChI: InChI=1S/C12H24O2/c1-4-5-6-7-8-9-11(10(2)3)12(13)14/h10-11,13H,4-9H2,1-3H3
charge 0 multiplicity 1
38 atoms
O  2.816653 2.209985 -0.488408
O  2.298851 1.307396 1.58043
C  2.169533 -0.129429 -0.444089
C  0.826969 -0.77271 -0.006759
C  3.390114 -1.115778 -0.30597
C  -0.41287 0.0560 -0.411769
C  -1.740533 -0.595886 0.035044
C  -2.987023 0.230279 -0.354661
C  -4.31487 -0.405441 0.114854
C  4.693296 -0.491173 -0.859336
C  3.598198 -1.645384 1.132108
C  2.414197 1.148956 0.342754
C  -5.561044 0.423074 -0.273046
C  -6.882832 -0.212358 0.209677
H  2.105799 0.156901 -1.511414
H  0.760998 -1.782107 -0.461453
H  0.829627 -0.908632 1.091143
H  3.125974 -1.978817 -0.953696
H  -0.423128 0.198356 -1.512637
H  -0.34211 1.069017 0.035359
H  -1.820323 -1.611636 -0.406571
H  -1.724042 -0.735662 1.136005
H  -3.011879 0.360471 -1.457054
H  -2.897872 1.249665 0.076063
H  -4.407063 -1.425898 -0.313181
H  -4.290624 -0.532996 1.217496
H  5.496917 -1.249394 -0.898722
H  4.549573 -0.086153 -1.877757
H  5.046198 0.337057 -0.217168
H  2.713474 -2.192126 1.502846
H  4.45811 -2.340071 1.15674
H  3.801945 -0.819866 1.837149
H  -5.588435 0.545276 -1.375266
H  -5.464233 1.444112 0.149744
H  -6.892648 -0.316907 1.311177
H  -7.0188 -1.221763 -0.222903
H  -7.757323 0.399424 -0.079308
H  2.980926 3.015719 0.075177
