program: Gaussian 09
title: 000292819
version: EM64L-G09RevD.01
frameworkgroup: C1[X(C10H22N2O2)]
method: RPBEPBE
basis: SDD
operation: Freq
keyword: #p
keyword: freq=noraman
keyword: PBEPBE/SDD
title: #p freq=noraman PBEPBE/SDD
converged: YES YES NO NO
title: Mulliken charges:
elementType: O O N N C C C C C C C C C C H H H H H H H H H H H H H H H H H H H H H H
charge: -0.262433 -0.257283 -0.104923 -0.271086 -0.373122 -0.367576 -0.322136 -0.330528 -0.673119 -0.673268 -0.515868 0.257486 -0.263173 -0.661006 0.222904 0.178255 0.220354 0.207938 0.185336 0.202915 0.186419 0.214369 0.263682 0.211574 0.226279 0.204243 0.206312 0.226713 0.205222 0.246796 0.257774 0.233729 0.223610 0.228159 0.248615 0.216840
chargesum: 0.00000
title: Mulliken charges with hydrogens summed into heavy atoms:
elementType: O O N N C C C C C C C C C C
charge: -0.262433 -0.257283 -0.104923 -0.007404 0.028037 0.060716 0.066114 0.070259 -0.031024 -0.035022 -0.011298 0.257486 0.194166 0.032608
polarizability: 1.55543594e+02 3.91573658e+00 1.28944315e+02 3.26440498e+00 -2.30002179e+00 1.11609225e+02
1716.lowfreq: -6.4573 -5.1938 -0.0006 -0.0005 0.0007 6.7098 20.9496 24.4439 37.0761
frequency: 20.5209 24.1335 36.9086 64.4937 70.8913 73.4812 82.8366 96.2512 133.2715 156.0467 184.5772 204.5653 211.4898 238.8176 244.8176 285.2999 303.8662 316.0322 331.5003 387.6252 423.5136 451.1877 467.0484 514.9451 544.5653 633.1479 685.4810 745.1921 785.9891 793.8700 795.3071 810.7038 819.8901 865.0905 912.8066 926.7774 985.2720 1009.3476 1028.2616 1056.3377 1074.6590 1081.5280 1084.8459 1092.6957 1096.0555 1115.1661 1126.9928 1154.9901 1156.4897 1186.0209 1207.3312 1223.6467 1265.9711 1278.4624 1280.1598 1290.7825 1295.0888 1316.0102 1332.8630 1355.3789 1362.4776 1366.9625 1386.0363 1386.9358 1388.4652 1393.3322 1425.8465 1458.2303 1458.9693 1462.4269 1464.6767 1465.5847 1470.3756 1474.2930 1480.5867 1484.6204 1485.1602 1489.8890 1491.8846 1636.4436 2837.3888 2847.1412 2860.5561 2909.1249 2981.7985 2982.4112 2990.1064 2993.2527 3027.1166 3027.4708 3028.0587 3029.8064 3059.9393 3061.0452 3073.6814 3075.1439 3088.2537 3090.7890 3091.4278 3093.2207 3119.2400 3443.9032
redmass: 3.4253 3.9681 4.4892 2.6384 3.5642 2.6916 2.0112 2.8361 2.5064 1.8860 1.8689 1.4336 1.5368 1.5979 1.8476 1.8359 2.3734 3.0140 2.5195 3.2420 2.7102 2.6344 3.1893 3.4952 2.9375 2.1936 2.1263 2.5010 1.8427 1.1792 1.1410 1.2439 1.9919 3.5224 1.9934 2.2056 2.3281 2.6250 2.0342 2.7139 1.9196 1.9804 2.2101 2.5483 2.1950 3.0416 2.3131 1.7163 1.7390 2.6842 2.2842 1.5838 1.2484 1.1180 1.1179 1.2318 1.2394 1.3328 1.3206 1.2817 1.3285 1.3393 1.2639 1.2683 1.3361 1.2320 1.0975 1.0943 1.0706 1.0533 1.0431 1.1876 1.0587 1.0602 1.0577 1.0530 1.0639 1.0744 1.0877 8.6651 1.0719 1.0721 1.0712 1.0690 1.0357 1.0357 1.0633 1.0362 1.0887 1.0865 1.0598 1.0883 1.0976 1.0895 1.0984 1.0979 1.0974 1.1003 1.1002 1.1033 1.1058 1.0736
irintensity: 0.3698 0.3665 0.7537 0.1499 0.4251 0.5365 0.3122 0.2579 5.6648 3.8188 0.9366 0.6428 1.0263 10.3491 1.3331 1.5514 12.7696 12.8757 0.8404 12.8081 7.8612 6.3028 1.3000 8.0731 11.6400 42.1555 112.2280 8.6066 8.2473 7.1699 4.6462 3.6607 2.4876 18.2155 0.7004 21.2306 5.6762 40.2440 21.1303 14.5774 20.7748 21.1318 7.7791 8.1386 50.5628 199.9653 162.6839 7.1091 24.5343 8.8489 32.4782 22.6483 3.4577 3.0120 0.6116 18.3254 18.8377 6.6510 4.3196 1.7433 2.8580 4.1235 16.0668 22.2040 6.0957 22.2627 28.8597 10.1978 5.3459 7.2133 15.1020 21.1594 1.6261 2.3315 15.4698 9.3981 10.4097 16.3668 4.6125 149.6876 56.3574 33.2147 239.1724 65.8886 38.6291 26.7499 29.3803 18.4288 15.2241 11.6419 34.7180 24.5974 10.8784 32.6406 38.4858 82.0885 37.5969 35.8717 49.4699 0.4740 34.9711 0.3524
temp: 298.150 k
press: 1.00000 atm
elementType: 8 8 7 7 6 6 6 6 6 6 6 6 6 6 1 1 1 1 1 1 1 1 1 1 1 1 1 1 1 1 1 1 1 1 1 1
symmnumber: 1
zpe: 828302.5 jmol-1
zpe.correction: 0.315484 hartree
zpe.thermalcorrener: 0.333536 hartree
zpe.thermalcorrenthalpy: 0.334480 hartree
zpe.thermalcorrgfe: 0.266773 hartree
zpe.sumelectzpe: -653.015017 hartree
zpe.sumelectthermal: -652.996965 hartree
zpe.sumelectthermalent: -652.996021 hartree
zpe.sumelectthermalfe: -653.063728 hartree
dipole: 1.0369 0.4924 0.2069
dipole: 1.1664
quadrupole: -73.0490 -88.2951 -89.4189
quadrupole: 1.9281 3.8387 2.1535
quadrupole: 10.5386 -4.7074 -5.8312 1.9281 3.8387 2.1535
hfenergy: -653.3305007 hartree
pointgroup: C01 [X(C10H22N2O2)]
dipole: 0.4078034 -0.202891 -0.0557916 debye
polarizability: 155.6089537|-4.314318|128.9080818|-1.1172318|-3.0284043|111.580098 unknown
InChI: InChI=1S/C10H22N2O2/c1-4-12(5-2)8-7-11-9-10(13)14-6-3/h11H,4-9H2,1-3H3
charge 0 multiplicity 1
36 atoms
O  3.746479 0.475995 -0.205553
O  2.284444 -0.2387 1.472206
N  -2.868184 -0.155636 0.006513
N  0.351996 1.771927 0.590659
C  -1.974239 0.92575 0.48957
C  -0.524851 0.733355 -0.000027
C  -4.264407 0.30077 -0.225947
C  -2.791856 -1.379635 0.850961
C  -4.414707 1.139413 -1.509469
C  -3.141255 -2.665804 0.077544
C  1.732616 1.773749 0.11193
C  2.576375 0.556834 0.549186
C  4.694401 -0.63526 0.130572
C  4.321813 -1.910707 -0.629779
H  -2.336408 1.898207 0.113463
H  -1.982141 0.997467 1.608813
H  -0.508702 0.8422 -1.100491
H  -0.183883 -0.30242 0.233359
H  -4.658018 0.876027 0.651153
H  -4.900551 -0.598456 -0.319236
H  -3.44723 -1.291082 1.755222
H  -1.755437 -1.466297 1.22599
H  0.307883 1.755867 1.618964
H  -3.807359 2.062213 -1.472198
H  -4.086357 0.552733 -2.385097
H  -5.469726 1.438531 -1.655937
H  -4.176943 -2.647732 -0.308043
H  -2.460873 -2.784321 -0.783596
H  -3.043809 -3.551117 0.733776
H  1.752537 1.829907 -0.99117
H  2.258211 2.677883 0.477794
H  4.670883 -0.796489 1.222891
H  5.675757 -0.239849 -0.176494
H  4.282764 -1.72392 -1.716819
H  3.342663 -2.293663 -0.296626
H  5.080418 -2.692939 -0.440383
