program: Gaussian 09
title: 000292836
version: EM64L-G09RevD.01
frameworkgroup: C1[X(C18H34O2)]
method: RPBEPBE
basis: SDD
operation: Freq
keyword: #pfreq=noraman
keyword: PBEPBE/SDD
title: #p freq=noraman PBEPBE/SDD
converged: YES YES NO NO
title: Mulliken charges:
elementType: O O C C C C C C C C C C C C C C C C C C H H H H H H H H H H H H H H H H H H H H H H H H H H H H H H H H H H
charge: -0.418101 -0.235356 -0.387131 -0.388572 -0.386216 -0.385798 -0.386144 -0.383940 -0.384514 -0.420995 -0.382177 -0.142490 -0.372561 -0.353450 -0.513072 -0.356622 0.140495 -0.024696 -0.696859 -0.594186 0.196240 0.192223 0.196877 0.191839 0.194524 0.192520 0.190046 0.201736 0.194412 0.192510 0.215089 0.186599 0.192204 0.193232 0.199300 0.239217 0.192296 0.191271 0.247212 0.189404 0.188856 0.187229 0.187833 0.219343 0.231098 0.194757 0.194515 0.241469 0.209550 0.214706 0.209685 0.372852 0.217443 0.214299
chargesum: 0.00000
title: Mulliken charges with hydrogens summed into heavy atoms:
elementType: O O C C C C C C C C C C C C C C C C C C
charge: -0.045249 -0.235356 0.001332 0.000144 0.000828 0.005984 0.000778 0.017748 0.000922 0.017522 0.001389 0.104722 0.005700 0.021611 -0.062631 0.032649 0.140495 0.216773 -0.062918 -0.162443
polarizability: 2.47293550e+02 3.72607390e+00 1.95710488e+02 -2.20769187e+00 2.51236522e+00 1.66390321e+02
1716.lowfreq: -7.8607 -0.8311 -0.0018 -0.0004 0.0013 4.9810 14.2552 20.8685 29.1232
frequency: 12.9694 20.6887 29.0090 32.8404 39.3028 45.1883 56.3333 64.9420 69.9644 81.5355 85.7432 97.9377 105.5737 113.9354 129.8599 138.4466 140.2356 151.5700 156.5718 158.4868 198.6650 225.8574 232.0685 248.5027 271.9380 304.6643 327.8850 379.1501 394.4080 429.2368 460.2832 482.1835 503.0138 514.3368 584.6267 591.4721 659.0017 719.6650 720.5661 722.2595 726.4250 734.4069 745.9423 764.6282 786.7375 813.5984 850.1633 876.1751 889.0390 893.0171 915.7891 946.6888 952.4344 977.9416 980.0096 992.5982 999.5940 1005.8037 1007.9775 1026.5185 1031.6571 1034.9769 1047.9600 1054.5883 1065.1398 1076.0708 1080.0451 1082.3525 1082.8949 1091.1365 1123.8930 1127.6141 1143.7754 1180.1431 1190.1534 1200.6441 1210.1491 1223.0973 1228.1825 1233.1076 1243.5361 1250.8620 1256.1862 1268.3312 1277.5488 1278.8562 1283.8647 1284.6113 1291.9480 1293.3825 1297.5184 1297.7032 1298.5802 1301.9198 1318.2733 1331.1148 1343.6168 1353.8096 1356.1743 1358.4134 1360.1477 1361.3044 1367.9466 1389.9166 1429.9326 1453.5837 1458.1036 1459.3157 1459.7759 1461.8536 1462.8044 1464.4732 1466.1821 1470.1980 1474.8433 1477.6866 1479.4575 1483.6876 1487.0612 1488.7514 1657.8504 1659.8457 2948.2486 2948.3173 2949.5425 2950.0188 2951.2557 2951.9629 2954.0871 2957.3626 2961.0423 2964.4180 2967.9559 2971.3485 2972.8043 2980.9397 2981.3331 2983.2244 2986.5106 2991.0897 2996.9125 3003.7009 3011.5444 3015.4325 3021.2021 3029.4561 3036.8203 3038.6958 3042.6624 3055.3537 3067.9977 3069.5684 3082.9520 3097.9689 3193.6776 3503.3684
redmass: 4.4925 4.5655 8.5080 3.7498 1.6866 4.0175 2.6969 2.2872 2.6376 2.4708 2.4622 2.1875 2.9340 2.1337 2.1953 2.6213 2.2392 3.4627 2.0203 2.0295 3.1494 3.0474 1.1317 3.2951 3.8075 3.3131 3.2368 2.6458 3.3730 2.6894 2.9967 3.0205 2.9483 3.0966 2.8360 1.3420 1.5775 1.1362 1.0886 1.1615 1.2597 1.4360 1.4277 1.4294 1.6719 1.4676 1.3622 2.0249 1.8899 1.4010 1.3914 1.3384 1.2586 4.5502 4.6282 1.3598 1.6745 2.0651 2.3418 1.5870 2.7931 1.6609 2.4037 1.8919 2.5822 2.4822 2.0841 2.2455 2.1859 2.7366 2.4764 1.8115 2.4259 1.8693 1.2741 1.5224 1.3108 1.4183 1.3596 1.3224 1.4376 1.4057 1.3139 1.2795 1.2200 1.0626 1.2147 1.0333 1.0636 1.1565 1.2116 1.1090 1.1229 1.2876 1.3430 1.3694 1.4333 1.5195 1.7116 1.6545 1.6108 1.6079 1.7077 1.2185 1.1874 1.0820 1.0953 1.0753 1.0762 1.0718 1.0734 1.0642 1.0818 1.0860 1.0866 1.0424 1.0889 1.0925 1.0947 1.0944 8.1112 4.6656 1.0587 1.0587 1.0591 1.0591 1.0596 1.0596 1.0598 1.0598 1.0595 1.0589 1.0584 1.0368 1.0610 1.0874 1.0756 1.0949 1.0966 1.0980 1.0996 1.1013 1.1007 1.0886 1.1030 1.1043 1.1042 1.1001 1.1043 1.1010 1.1006 1.0993 1.0613 1.0930 1.1142 1.0638
irintensity: 0.0760 0.1150 1.7239 0.0978 0.0298 0.0221 0.1191 0.1356 0.1249 0.0631 0.1091 0.0661 0.0666 0.0198 0.0382 0.0209 0.0387 0.1274 0.0066 0.0183 0.0100 0.5380 0.0041 0.6899 1.4912 1.2318 1.3875 0.9022 2.9763 1.0072 3.3132 11.9136 3.2178 22.1527 12.1782 38.9701 110.6286 20.1633 7.7671 6.4560 2.1835 3.8166 4.3386 0.9679 1.6103 0.5507 0.2486 4.4439 5.8164 2.4197 2.9237 79.1190 0.7184 10.4176 6.0930 5.2712 36.2889 9.6249 33.3350 3.7766 165.1646 4.9637 17.7109 62.7075 0.8895 0.1268 0.0684 0.3898 0.0026 4.0828 18.2791 8.1449 9.3875 1.3238 19.7238 5.6627 4.8870 2.1528 4.6645 0.6081 2.7010 3.9815 1.9239 1.9912 0.2062 0.1706 1.0694 0.2431 0.4956 0.5129 0.6539 0.0279 0.3493 1.7696 0.9946 0.3656 0.0785 1.2381 0.0256 0.1434 0.0151 0.3717 26.0091 11.1972 4.1211 8.3664 9.9896 0.1806 0.8263 0.2018 0.5164 0.1267 0.6350 1.3736 1.2198 12.2832 1.7810 1.8883 4.8178 41.5239 170.4124 13.2492 0.0017 0.0447 0.0034 0.1830 0.0606 1.7917 0.3456 6.1524 0.3564 170.2740 211.2895 36.2796 23.0515 4.8242 22.8288 4.2743 3.0105 2.5835 1.7785 0.9726 2.9539 13.5295 2.0818 12.4762 1.1734 17.5518 303.0825 84.9589 98.6890 56.0148 15.1799 5.9830 24.9140 20.6542
temp: 298.150 k
press: 1.00000 atm
elementType: 8 8 6 6 6 6 6 6 6 6 6 6 6 6 6 6 6 6 6 6 1 1 1 1 1 1 1 1 1 1 1 1 1 1 1 1 1 1 1 1 1 1 1 1 1 1 1 1 1 1 1 1 1 1
symmnumber: 1
zpe: 1268004.1 jmol-1
zpe.correction: 0.482957 hartree
zpe.thermalcorrener: 0.509060 hartree
zpe.thermalcorrenthalpy: 0.510004 hartree
zpe.thermalcorrgfe: 0.421255 hartree
zpe.sumelectzpe: -855.109280 hartree
zpe.sumelectthermal: -855.083177 hartree
zpe.sumelectthermalent: -855.082233 hartree
zpe.sumelectthermalfe: -855.170983 hartree
dipole: 0.3194 -0.1586 -1.4425
dipole: 1.4859
quadrupole: -126.3717 -123.1789 -128.5875
quadrupole: -2.2163 -5.7098 -2.4926
quadrupole: -0.3256 2.8671 -2.5414 -2.2163 -5.7098 -2.4926
hfenergy: -855.5922372 hartree
pointgroup: C01 [X(C18H34O2)]
dipole: -0.1246346 0.0888926 -0.5642174 debye
polarizability: 247.3942332|2.8452797|195.7751169|2.3031715|-1.268055|166.2250085 unknown
InChI: InChI=1S/C18H34O2/c1-3-5-6-7-8-9-10-11-12-13-14-16-17(15-4-2)18(19)20/h4,17,19H,2-3,5-16H2,1H3
charge 0 multiplicity 1
54 atoms
O  -6.525348 2.590964 0.008518
O  -5.538117 1.349975 1.700145
C  0.835561 -0.39626 -0.056793
C  -0.434138 0.430315 -0.360752
C  2.146076 0.397088 -0.258317
C  -1.742486 -0.374766 -0.196636
C  3.416077 -0.425414 0.055551
C  -3.01231 0.460474 -0.473826
C  4.726928 0.361249 -0.169133
C  -4.309782 -0.370589 -0.363384
C  5.997588 -0.459183 0.147597
C  -5.592669 0.450728 -0.622088
C  7.308214 0.324485 -0.089549
C  8.579776 -0.494928 0.226335
C  -6.868425 -0.455595 -0.777796
C  9.889935 0.289064 -0.015156
C  -5.83985 1.459894 0.490652
C  -7.149298 -1.343076 0.418145
C  11.155606 -0.538015 0.298282
C  -7.360953 -2.681166 0.352369
H  0.78854 -0.768366 0.988102
H  0.85033 -1.296984 -0.706165
H  -0.462479 1.316492 0.30743
H  -0.374781 0.82489 -1.397024
H  2.128943 1.30302 0.383453
H  2.19545 0.760775 -1.306315
H  -1.720952 -1.25032 -0.879596
H  -1.795442 -0.785047 0.833066
H  3.374574 -0.776119 1.108177
H  3.425361 -1.339188 -0.575327
H  -3.05207 1.304999 0.244134
H  -2.943469 0.908026 -1.488005
H  4.768761 0.708334 -1.223069
H  4.716891 1.277256 0.458378
H  -4.27926 -1.203343 -1.094753
H  -4.373169 -0.831632 0.640206
H  5.960186 -0.799651 1.203772
H  6.00372 -1.37905 -0.474336
H  -5.492652 1.027249 -1.561576
H  7.302221 1.244799 0.531759
H  7.34501 0.664325 -1.146064
H  8.586431 -1.416316 -0.393401
H  8.546206 -0.833009 1.283471
H  -6.732869 -1.078005 -1.68233
H  -7.737759 0.207324 -0.965385
H  9.883943 1.207948 0.606399
H  9.920828 0.629091 -1.070669
H  -7.193009 -0.842473 1.39724
H  11.202722 -1.4449 -0.334052
H  12.077339 0.046237 0.120233
H  11.162416 -0.866657 1.354928
H  -6.706043 3.208934 0.76888
H  -7.582766 -3.272103 1.248129
H  -7.320338 -3.225678 -0.599955
