program: Gaussian 09
title: 000292833
version: EM64L-G09RevD.01
frameworkgroup: C1[X(C16H30O2)]
method: RPBEPBE
basis: SDD
operation: Freq
keyword: #pfreq=noraman
keyword: PBEPBE/SDD
title: #p freq=noraman PBEPBE/SDD
converged: YES YES NO NO
title: Mulliken charges:
elementType: O O C C C C C C C C C C C C C C C C H H H H H H H H H H H H H H H H H H H H H H H H H H H H H H
charge: -0.416067 -0.238614 0.040377 -0.455538 -0.453490 -0.451685 -0.403456 -0.404255 -0.382895 -0.462979 -0.102501 -0.450086 -0.378457 0.129643 -0.373855 -0.356666 -0.357289 -0.696726 0.193575 0.198472 0.190259 0.186290 0.206764 0.210371 0.198896 0.192869 0.195650 0.195608 0.190759 0.187022 0.198211 0.223871 0.216361 0.238314 0.224527 0.204326 0.208617 0.196427 0.188490 0.194581 0.190414 0.188582 0.194511 0.196170 0.369086 0.215484 0.209642 0.210389
chargesum: 0.00000
title: Mulliken charges with hydrogens summed into heavy atoms:
elementType: O O C C C C C C C C C C C C C C C C
charge: -0.046980 -0.238614 0.233952 -0.066807 -0.060436 -0.042419 -0.014938 -0.017888 0.002338 -0.022747 0.135813 -0.021233 0.026587 0.129643 0.009215 0.022331 0.033393 -0.061211
polarizability: 2.17641729e+02 1.11562010e+00 1.66812630e+02 -1.23653241e+00 -2.40820106e+00 1.47108413e+02
1716.lowfreq: -10.0450 -3.2095 -0.0012 -0.0009 0.0008 9.1209 21.9895 28.3298 32.4124
frequency: 20.7977 27.4873 30.9031 35.0124 48.2597 48.8902 74.4950 86.2164 94.0012 115.0897 138.2879 142.8045 161.8312 180.9085 191.2446 218.5273 231.7997 254.0256 267.0253 315.2515 330.8332 361.6102 412.3987 423.0788 430.5194 443.1810 474.9344 508.8342 548.6267 586.0169 631.0904 718.2669 724.0062 726.7262 742.1655 766.6873 780.7977 788.6228 812.2476 839.3414 866.7457 887.4718 887.7343 893.2734 912.4294 955.8397 965.3022 992.1268 993.9057 1005.7648 1027.6903 1043.4537 1048.8113 1052.5181 1054.3516 1059.8192 1074.2731 1080.2151 1087.3200 1097.1827 1110.3052 1115.3663 1122.1917 1143.2120 1172.4819 1186.8795 1195.1243 1224.8935 1233.9391 1243.2536 1246.6764 1255.1701 1258.6298 1263.2332 1275.3635 1280.1620 1286.5573 1289.1268 1295.0216 1300.4802 1311.8162 1316.4712 1327.3355 1333.6444 1336.7212 1339.6640 1340.5924 1352.4506 1355.6035 1359.3629 1360.2080 1374.7436 1389.7460 1450.1485 1455.7993 1459.6588 1460.8443 1461.7128 1462.6421 1464.8764 1467.1983 1470.5573 1472.8676 1476.5861 1477.5442 1480.7642 1487.8168 1656.9140 2932.4652 2948.7141 2950.7337 2951.1967 2953.9244 2957.9763 2961.2337 2963.2530 2963.7264 2964.8007 2967.6678 2971.6376 2973.4233 2980.5631 2986.9982 2999.1268 3000.7524 3012.4756 3013.7840 3019.8151 3022.0883 3024.2932 3026.0936 3032.2279 3038.7843 3043.8505 3053.7278 3068.2572 3070.5923 3494.0168
redmass: 4.0964 3.5043 3.2817 8.3808 1.8452 2.9627 3.8658 2.8465 3.2175 1.7165 2.3245 3.2090 3.7839 2.4988 2.2484 1.7662 1.1217 3.3353 3.4025 1.8730 3.5913 2.9827 3.2958 2.5790 2.9434 2.1220 2.6522 3.2227 1.8405 3.2688 1.2644 1.4846 1.3421 1.4977 1.6043 1.7677 1.4577 1.8814 1.5004 2.0699 1.6877 1.7873 1.6658 1.4197 1.8010 2.4529 1.4746 3.5363 1.9186 2.1321 3.4025 1.9797 2.3208 1.8010 1.8750 1.2236 2.4051 1.9648 1.5498 2.3116 2.0063 2.5390 2.3264 2.0010 1.6065 1.5588 1.5972 1.2796 1.4507 1.3486 1.3578 1.2811 1.2825 1.2223 1.2541 1.1875 1.0682 1.1750 1.1902 1.1587 1.2935 1.2579 1.4092 1.3716 1.4282 1.5009 1.5716 1.5423 1.5866 1.5757 1.5225 1.6375 1.2182 1.0786 1.0832 1.0892 1.0824 1.0782 1.0885 1.0776 1.0854 1.0881 1.0809 1.0959 1.0425 1.0792 1.0880 7.7577 1.0802 1.0603 1.0591 1.0611 1.0590 1.0624 1.0594 1.0589 1.0620 1.0679 1.0591 1.0365 1.0594 1.0595 1.0970 1.0998 1.0998 1.0973 1.0979 1.0923 1.0991 1.0944 1.1021 1.1034 1.1037 1.1045 1.1012 1.1007 1.0993 1.0636
irintensity: 0.0364 0.0271 0.1654 2.5502 0.0407 0.0459 0.2399 0.0498 0.0055 0.0247 0.0020 0.0390 0.0334 0.0094 0.0856 0.1330 0.0067 2.6678 1.0207 0.1507 0.0284 1.9757 4.6383 0.2979 0.6388 1.9984 3.5078 18.5855 4.9761 5.6911 129.9515 22.7584 20.5616 3.7479 13.5468 3.1899 0.2347 0.4330 1.7639 6.9666 1.3787 3.8428 10.2927 3.5419 0.8477 6.4869 3.7953 3.3576 10.1433 0.7874 105.6421 11.6384 52.0597 0.2709 64.1962 7.4700 2.8233 0.9221 4.0024 5.7614 5.8600 0.1223 5.4704 17.9514 3.3728 1.3929 1.9131 10.2556 0.0198 0.3773 1.7194 2.5722 2.9903 2.9357 1.3646 0.5760 0.7917 0.0624 0.4791 0.9214 0.7410 1.6375 0.9801 0.1315 0.2871 1.2347 1.4757 1.0117 1.7888 5.0568 1.2303 15.0898 11.5686 0.0935 1.6808 5.4278 0.5561 1.0543 9.9265 1.0603 5.2332 21.6653 6.2420 4.2197 12.4827 5.7702 22.3849 164.0908 4.2340 2.0402 1.5323 26.2512 4.0697 86.5040 10.2195 27.6134 30.8434 31.3648 76.7902 38.8295 53.1545 47.6187 1.3167 0.1740 5.7539 6.1762 75.8323 17.8122 69.2678 51.0495 10.8125 41.2372 142.3528 8.5409 125.4565 97.6172 55.7097 16.5372
temp: 298.150 k
press: 1.00000 atm
elementType: 8 8 6 6 6 6 6 6 6 6 6 6 6 6 6 6 6 6 1 1 1 1 1 1 1 1 1 1 1 1 1 1 1 1 1 1 1 1 1 1 1 1 1 1 1 1 1 1
symmnumber: 1
zpe: 1132083.8 jmol-1
zpe.correction: 0.431188 hartree
zpe.thermalcorrener: 0.452635 hartree
zpe.thermalcorrenthalpy: 0.453579 hartree
zpe.thermalcorrgfe: 0.377311 hartree
zpe.sumelectzpe: -776.694604 hartree
zpe.sumelectthermal: -776.673157 hartree
zpe.sumelectthermalent: -776.672213 hartree
zpe.sumelectthermalfe: -776.748482 hartree
dipole: -0.0554 -0.6673 -1.2803
dipole: 1.4448
quadrupole: -112.1560 -109.7501 -118.9005
quadrupole: 0.0288 -0.3284 -2.3886
quadrupole: 1.4462 3.8521 -5.2983 0.0288 -0.3284 -2.3886
hfenergy: -777.1257921 hartree
pointgroup: C01 [X(C16H30O2)]
dipole: 0.0217435 -0.2635873 0.5031468 debye
polarizability: 217.6360284|-1.1942166|166.806462|-1.2887429|2.4514361|147.1202816 unknown
InChI: InChI=1S/C16H30O2/c1-2-3-4-8-11-15(16(17)18)13-12-14-9-6-5-7-10-14/h14-15,17H,2-13H2,1H3
charge 0 multiplicity 1
48 atoms
O  -0.75128 2.732257 0.791999
O  -0.590162 2.150565 -1.446477
C  3.453185 -0.072214 -0.14284
C  4.627507 0.810455 0.356188
C  3.716201 -1.557198 0.225545
C  2.101497 0.452113 0.404743
C  5.996146 0.321171 -0.173249
C  5.083404 -2.054643 -0.303128
C  6.24354 -1.161195 0.195173
C  0.859044 -0.245344 -0.194268
C  -0.490458 0.370418 0.274159
C  -1.699245 -0.46711 -0.235261
C  -3.074246 0.044653 0.24819
C  -0.608098 1.79522 -0.245872
C  -4.241656 -0.857522 -0.210992
C  -5.625181 -0.344018 0.247509
C  -6.794273 -1.248209 -0.205443
C  -8.173439 -0.723023 0.248822
H  3.423068 0.001643 -1.253509
H  4.457196 1.863374 0.053964
H  4.63906 0.795507 1.46729
H  3.692244 -1.657013 1.332382
H  2.908764 -2.202584 -0.171647
H  2.042035 1.540688 0.196229
H  2.088685 0.346132 1.510307
H  6.019976 0.429531 -1.277694
H  6.809246 0.957406 0.227953
H  5.248998 -3.105893 0.004271
H  5.068815 -2.044407 -1.413092
H  6.326794 -1.253456 1.298325
H  7.205727 -1.508229 -0.229599
H  0.90177 -0.198087 -1.300824
H  0.852188 -1.316046 0.086445
H  -0.514034 0.413181 1.379172
H  -1.675591 -0.485342 -1.342946
H  -1.554162 -1.510613 0.109793
H  -3.243503 1.073629 -0.129889
H  -3.075225 0.115109 1.355672
H  -4.085815 -1.886507 0.17626
H  -4.229288 -0.936549 -1.318174
H  -5.784222 0.681967 -0.14554
H  -5.637418 -0.257564 1.354358
H  -6.637674 -2.272152 0.191446
H  -6.777313 -1.337796 -1.310948
H  -0.829227 3.644154 0.396388
H  -8.991492 -1.386679 -0.086985
H  -8.226899 -0.651793 1.35177
H  -8.366987 0.286318 -0.161181
