program: Gaussian 09
title: 000292816
version: EM64L-G09RevD.01
frameworkgroup: C1[X(C14H11N5O)]
method: RPBEPBE
basis: SDD
operation: Freq
keyword: #p
keyword: freq=noraman
keyword: PBEPBE/SDD
title: #p freq=noraman PBEPBE/SDD
converged: YES YES NO NO
title: Mulliken charges:
elementType: O N N N N N C C C C C C C C C C C C C C H H H H H H H H H H H
charge: -0.196747 -0.517122 -0.472776 -0.097050 -0.096367 -0.095382 0.202288 0.191932 0.050397 -0.332576 -0.302515 0.492859 -0.240680 -0.203096 0.249550 -0.444447 -0.331337 -0.196422 -0.215394 -0.252318 0.218137 0.316211 0.270447 0.238384 0.308786 0.242725 0.218167 0.303973 0.228374 0.230393 0.231604
chargesum: 0.00000
title: Mulliken charges with hydrogens summed into heavy atoms:
elementType: O N N N N N C C C C C C C C C C C C C C
charge: -0.196747 -0.200910 -0.163990 -0.097050 -0.096367 -0.095382 0.202288 0.191932 0.050397 -0.114439 -0.032068 0.492859 -0.002296 0.039629 0.249550 -0.226280 -0.027364 0.031952 0.014999 -0.020714
polarizability: 3.37824664e+02 -5.81812730e+00 1.73938752e+02 1.88298529e+00 8.22105380e+00 1.08335731e+02
1716.lowfreq: -5.1065 -0.9559 -0.0009 -0.0006 -0.0004 6.8535 21.0797 27.7453 39.5438
frequency: 20.8344 27.2449 39.5131 76.8352 89.4924 106.3980 163.9615 172.6426 190.0973 246.1805 250.7720 330.9780 342.9943 406.3721 410.2893 434.8551 441.2089 446.8083 485.9779 506.6896 514.3065 546.6369 586.6601 610.5187 612.9552 632.5640 651.1486 673.8945 695.7764 712.4013 757.6078 768.6972 771.6179 793.8971 799.9117 835.9123 842.0813 874.3237 875.8639 917.6341 923.7494 956.6451 966.5943 973.2717 985.3418 1000.1538 1004.1987 1022.0062 1027.8076 1080.3295 1091.7699 1100.4571 1142.0035 1161.8838 1173.8443 1175.3505 1190.9637 1212.5105 1248.9839 1255.5588 1320.7590 1343.1600 1369.5672 1386.1065 1414.2574 1428.8532 1442.7543 1460.2622 1485.1978 1498.7293 1515.1472 1560.2099 1601.3231 1615.2940 1615.9685 1672.5429 3109.5431 3124.7010 3135.2260 3145.6870 3147.3919 3161.9346 3167.5144 3178.4415 3195.6529 3526.6993 3538.8580
redmass: 6.2986 4.7012 5.4141 5.7051 4.9508 6.4191 6.6718 6.5664 7.6738 6.1349 4.4453 6.6529 5.9346 2.9064 3.5352 1.6698 2.3251 5.6198 7.4737 4.7156 3.8569 8.3429 5.1569 1.6536 3.2906 4.4979 5.7829 6.2058 2.0006 6.1642 3.9200 1.6774 1.8163 4.6986 5.1818 4.2686 1.3653 3.7242 2.0732 1.4383 8.5815 6.2301 1.4364 1.3594 5.9922 1.3159 1.3425 2.3566 2.1623 3.5274 1.6834 3.8953 2.1860 2.5450 1.0526 1.2223 1.1127 3.2000 1.8640 1.9899 1.4681 2.0490 2.9305 5.6768 6.9468 2.4212 2.4383 2.7985 2.3136 2.4118 2.9163 6.5221 5.3833 6.2471 6.1022 7.2649 1.0889 1.0876 1.0868 1.0896 1.0933 1.0947 1.0998 1.0993 1.0953 1.0765 1.0762
irintensity: 0.7179 0.2917 0.4916 5.2147 3.1533 0.9627 0.8856 1.4710 1.2840 0.6743 1.5773 3.7335 0.9176 0.2617 0.3333 87.2210 81.7650 2.8760 5.5644 10.3678 15.7615 8.4292 23.7653 26.7606 11.2388 6.7405 3.0218 62.1119 46.1501 2.4197 27.1403 77.7378 78.6297 3.0351 19.1585 3.4132 0.6444 41.9775 7.4254 12.5463 31.0315 138.4548 7.9643 0.2233 1.5313 2.4036 0.2392 4.5664 0.8901 17.3456 20.6594 14.6234 202.0988 200.7992 0.4583 22.4378 1.6870 52.4194 105.6797 7.1295 114.9492 32.9755 335.2776 16.7270 60.1376 107.8099 386.3517 69.8047 45.1998 580.5755 5.6361 2.9812 26.5101 43.5633 18.4780 224.1087 15.9519 5.3359 0.2364 10.1434 27.8915 13.1009 26.2856 15.1986 7.3690 15.9467 16.4754
temp: 298.150 k
press: 1.00000 atm
elementType: 8 7 7 7 7 7 6 6 6 6 6 6 6 6 6 6 6 6 6 6 1 1 1 1 1 1 1 1 1 1 1
symmnumber: 1
zpe: 601241.7 jmol-1
zpe.correction: 0.229001 hartree
zpe.thermalcorrener: 0.245025 hartree
zpe.thermalcorrenthalpy: 0.245969 hartree
zpe.thermalcorrgfe: 0.183160 hartree
zpe.sumelectzpe: -887.650366 hartree
zpe.sumelectthermal: -887.634342 hartree
zpe.sumelectthermalent: -887.633398 hartree
zpe.sumelectthermalfe: -887.696207 hartree
dipole: -0.1790 -9.2631 -0.8983
dipole: 9.3083
quadrupole: -90.4736 -122.5322 -116.5745
quadrupole: -15.7393 6.6740 5.4412
quadrupole: 19.3865 -12.6721 -6.7144 -15.7393 6.6740 5.4412
hfenergy: -887.8793673 hartree
pointgroup: C01 [X(C14H11N5O1)]
dipole: 0.1435978 -3.6407165 -0.3686992 debye
polarizability: 337.5583897|8.8795859|174.8833354|0.0112201|4.9560595|107.657421 unknown
InChI: InChI=1S/C14H11N5O/c20-14(15-10-6-2-1-3-7-10)16-13-11-8-4-5-9-12(11)17-19-18-13/h1-9,15-16H
charge 0 multiplicity 1
31 atoms
O  1.129426 1.246305 -0.877444
N  -0.225762 -0.460279 0.079088
N  2.088174 -0.512629 0.374185
N  -1.361875 1.448437 0.843652
N  -3.758623 1.583101 0.977478
N  -2.552084 2.144722 1.156108
C  -2.694962 -0.446467 0.008277
C  -1.433632 0.201849 0.301711
C  -3.854777 0.29966 0.407369
C  -2.86428 -1.714168 -0.625736
C  -5.159369 -0.242298 0.209722
C  3.487021 -0.316296 0.168094
C  -4.152216 -2.230721 -0.81713
C  -5.303039 -1.497673 -0.389349
C  1.034009 0.207505 -0.185498
C  4.369318 -1.22064 0.817868
C  4.011588 0.723808 -0.643372
C  5.763248 -1.091331 0.656161
C  5.410271 0.834348 -0.799666
C  6.293585 -0.063251 -0.157782
H  -2.000398 -2.280458 -0.993179
H  -0.25356 -1.474517 -0.043435
H  -6.017027 0.356047 0.531283
H  -4.282947 -3.200589 -1.308784
H  1.837567 -1.211708 1.077458
H  -6.300712 -1.920574 -0.546276
H  3.96566 -2.024077 1.448337
H  3.332668 1.430628 -1.123639
H  6.4330 -1.793321 1.164732
H  5.810167 1.639457 -1.425935
H  7.376459 0.038227 -0.284295
