program: Gaussian 09
title: 000003514
version: EM64L-G09RevD.01
frameworkgroup: C1[X(C10H16N4O7S)]
method: RPBEPBE
basis: SDD
operation: Freq
keyword: #p
keyword: freq=noraman
keyword: PBEPBE/SDD
title: #p freq=noraman PBEPBE/SDD
converged: YES YES NO NO
title: Mulliken charges:
elementType: S O O O O O O O N N N N C C C C C C C C C C H H H H H H H H H H H H H H H H
charge: 0.211999 -0.289950 -0.276438 -0.417154 -0.240823 -0.450306 -0.207636 -0.103392 -0.397657 -0.652746 -0.371265 -0.055546 -0.369609 -0.146788 -0.551624 -0.098704 0.252381 -0.726062 0.204291 0.166352 -0.387845 0.184782 0.249386 0.227336 0.284085 0.220590 0.260041 0.209638 0.353476 0.336822 0.264612 0.315143 0.279837 0.366846 0.286375 0.284806 0.384621 0.400127
chargesum: 0.00000
title: Mulliken charges with hydrogens summed into heavy atoms:
elementType: S O O O O O O O N N N N C C C C C C C C C C
charge: 0.211999 -0.289950 -0.276438 -0.032533 -0.240823 -0.050179 -0.207636 -0.103392 -0.044182 -0.057767 -0.004419 -0.055546 0.107113 0.137297 -0.070993 0.110934 0.252381 -0.124627 0.204291 0.166352 0.183336 0.184782
polarizability: 2.68031813e+02 6.19924361e+00 1.41902013e+02 -1.30874696e+01 1.17880997e+01 1.47912784e+02
1716.lowfreq: -8.7905 -4.2685 0.0011 0.0015 0.0017 2.4641 11.6279 16.1870 19.9392
frequency: 11.3714 16.1307 19.4771 26.9920 28.8967 39.1516 43.0929 55.2949 57.4498 69.5022 85.3061 106.7029 112.6412 136.6282 152.1702 179.5175 188.0380 207.5304 210.8361 227.1038 234.5968 269.7551 281.9303 306.9119 318.3256 328.2273 359.5825 396.9736 431.4635 446.1186 487.9784 494.3626 511.1095 541.7955 545.4155 563.2655 579.5912 591.2950 605.9332 620.5930 633.9134 646.5883 650.3224 684.7147 690.3173 714.4175 769.2437 773.7587 817.0377 823.1839 884.9077 912.7829 942.1768 978.8834 980.7908 1009.1589 1037.5445 1052.7957 1062.7949 1077.6287 1094.4771 1120.8352 1136.6822 1145.8330 1174.9300 1194.2053 1212.9562 1226.8473 1229.4597 1235.2317 1257.2295 1268.5720 1281.9674 1296.8952 1306.9329 1318.3790 1325.4174 1337.7183 1357.4808 1379.7120 1436.6860 1449.5310 1457.7478 1468.2839 1471.1483 1497.3886 1523.9009 1587.7129 1599.7198 1613.9719 1663.4408 1689.1167 2825.6749 2955.9608 2975.7365 2997.6799 3003.6562 3009.7569 3037.9585 3061.1510 3083.5550 3103.5410 3467.8584 3508.5495 3512.9180 3536.9925 3541.5217 3659.0652
redmass: 6.9414 7.2887 7.0774 10.3860 8.7802 8.6699 8.7695 5.5349 8.2387 5.8156 9.3441 4.3017 4.9537 3.9855 4.9747 3.4899 4.2435 5.1419 7.1972 5.7665 1.4247 4.5755 4.3066 6.1302 3.5108 5.7748 4.0768 4.0040 1.7916 2.2294 2.3147 2.7586 4.9283 4.2878 3.5664 3.6485 3.2259 1.8754 2.3888 2.1514 2.4842 1.9980 3.0125 2.6356 1.2688 2.3472 5.3749 2.9258 2.5054 2.9655 2.3063 4.2744 4.5765 2.0277 2.1898 2.5018 2.8693 3.1270 2.9353 2.0907 3.3744 1.8100 1.6727 1.1948 1.5310 2.0721 1.0886 1.6892 1.7099 1.2975 1.1964 1.6276 1.3231 1.5500 2.0221 1.2893 1.3350 1.6536 1.7201 1.8294 1.1076 1.0976 1.0789 2.4272 1.1021 2.3715 8.8698 7.7277 1.3282 6.7832 3.7691 9.3757 1.0788 1.0810 1.0663 1.0602 1.0637 1.0602 1.0998 1.0963 1.1005 1.0994 1.0780 1.0637 1.0453 1.0648 1.0781 1.1009
irintensity: 0.2892 0.3104 0.5935 0.7352 0.6428 4.7454 1.1333 0.9942 1.6353 1.5026 4.7804 1.8580 6.5628 5.7723 4.2480 8.9566 10.4173 3.0765 0.6344 13.0358 23.1111 4.0028 5.1404 1.6502 30.8652 21.1020 1.3420 35.3044 145.7616 101.9982 63.5374 13.4245 8.3527 47.7380 7.3594 30.3252 8.1459 39.6450 45.6399 70.9240 38.6969 174.0479 57.2335 11.8372 145.3380 7.6093 5.4827 19.1540 5.6081 9.7396 33.7525 9.9945 9.4697 0.8628 5.6491 12.4706 1.4258 210.9771 46.1796 219.7999 17.7076 1.8795 4.6689 1.0299 19.7274 8.6557 0.1476 17.5151 14.8164 0.7464 11.3813 12.4493 29.0358 14.9454 43.5521 32.1582 9.0207 9.8419 22.6013 1.5391 40.5509 12.1102 11.7064 796.6448 31.7473 69.3277 593.3375 190.5887 187.6088 69.4642 177.6096 268.9682 70.6783 14.3280 12.1134 19.9937 16.8152 17.3542 2.8385 3.5406 25.2782 6.2313 104.4957 26.5646 14.9707 30.4964 78.7882 16.3557
temp: 298.150 k
press: 1.00000 atm
elementType: 16 8 8 8 8 8 8 8 7 7 7 7 6 6 6 6 6 6 6 6 6 6 1 1 1 1 1 1 1 1 1 1 1 1 1 1 1 1
symmnumber: 1
zpe: 733753.5 jmol-1
zpe.correction: 0.279472 hartree
zpe.thermalcorrener: 0.304744 hartree
zpe.thermalcorrenthalpy: 0.305688 hartree
zpe.thermalcorrgfe: 0.217474 hartree
zpe.sumelectzpe: -1532.571510 hartree
zpe.sumelectthermal: -1532.546238 hartree
zpe.sumelectthermalent: -1532.545294 hartree
zpe.sumelectthermalfe: -1532.633508 hartree
dipole: 1.8895 0.7865 1.0617
dipole: 2.3056
quadrupole: -142.5719 -142.0567 -135.4388
quadrupole: -5.2847 23.4720 1.0047
quadrupole: -2.5494 -2.0342 4.5837 -5.2847 23.4720 1.0047
hfenergy: -1532.8509818 hartree
pointgroup: C01 [X(C10H16N4O7S1)]
dipole: -0.7326578 0.3844715 -0.3717964 debye
polarizability: 268.0266063|-6.5672043|145.798493|-13.1360609|-11.910982|144.0215112 unknown
InChI: InChI=1S/C10H16N4O7S/c11-5(10(19)20)1-2-7(15)13-6(4-22-14-21)9(18)12-3-8(16)17/h5-6,12-13,16,19H,1-4,11H2
charge 0 multiplicity 1
38 atoms
S  -1.848931 2.229327 1.346456
O  1.483763 1.478942 -1.487143
O  -1.468075 -1.596807 0.840771
O  4.838791 -1.383447 1.637975
O  6.91145 -1.591402 0.627383
O  -5.558028 -0.409144 -1.46606
O  -6.531361 -2.168611 -0.290919
O  -4.622589 2.399904 1.785709
N  0.38431 0.121787 0.031016
N  6.4280 0.453364 -1.110834
N  -3.15879 -0.730937 -0.482513
N  -3.812034 2.172983 0.890187
C  3.996861 0.166482 -0.712973
C  -0.919617 0.327906 -0.597583
C  2.824877 0.382457 0.269949
C  5.417045 0.253974 -0.077219
C  1.528948 0.703416 -0.475682
C  -1.438661 1.780086 -0.424941
C  -1.86992 -0.746826 -0.016401
C  5.820289 -0.986969 0.720966
C  -4.142627 -1.691696 0.022192
C  -5.528309 -1.483758 -0.562923
H  3.940646 0.959813 -1.481228
H  3.897048 -0.795115 -1.248166
H  -0.814665 0.175172 -1.693935
H  3.055006 1.25644 0.914836
H  2.701961 -0.48266 0.942563
H  5.379752 1.077893 0.684671
H  0.404291 -0.581264 0.78025
H  -0.66061 2.469209 -0.788615
H  -2.368917 1.95458 -0.999008
H  7.342628 0.035248 -0.933678
H  6.423608 1.356555 -1.581424
H  -3.494737 -0.015683 -1.131765
H  -4.22063 -1.633632 1.125236
H  -3.827839 -2.730406 -0.195668
H  5.176092 -2.169663 2.148028
H  -6.47763 -0.283517 -1.822509
