program: Gaussian 09
title: 000292807
version: EM64L-G09RevD.01
frameworkgroup: C1[X(C17H20N2O2)]
method: RPBEPBE
basis: SDD
operation: Freq
keyword: #p
keyword: freq=noraman
keyword: PBEPBE/SDD
title: #p freq=noraman PBEPBE/SDD
converged: YES YES NO YES
title: Mulliken charges:
elementType: O O N N C C C C C C C C C C C C C C C C C H H H H H H H H H H H H H H H H H H H H
charge: -0.267876 -0.290820 -0.502625 -0.504140 -0.240440 0.578502 -0.691728 -0.691727 -0.457870 -0.403384 0.469486 -0.457434 -0.356846 0.268243 0.477349 -0.436715 -0.336050 0.315823 -0.332413 -0.342587 -0.537737 0.205917 0.212232 0.210181 0.226350 0.226350 0.210181 0.212232 0.231639 0.227487 0.210683 0.302706 0.285341 0.285902 0.215021 0.304799 0.249529 0.239805 0.220806 0.220806 0.243022
chargesum: 0.00000
title: Mulliken charges with hydrogens summed into heavy atoms:
elementType: O O N N C C C C C C C C C C C C C C C C C
charge: -0.267876 -0.290820 -0.217284 -0.218238 -0.034523 0.578502 -0.042965 -0.042965 -0.226230 -0.175897 0.469486 -0.246752 -0.054140 0.268243 0.477349 -0.221694 -0.031251 0.315823 -0.082884 -0.102782 0.146898
polarizability: 3.90493382e+02 -4.09971157e+00 1.99639982e+02 4.86976917e-03 -9.45800969e-03 1.06231125e+02
1716.lowfreq: -0.0009 -0.0007 0.0008 4.2235 5.6478 18.9078 22.8275 26.1720 43.6399
frequency: 22.7565 25.8377 43.6044 47.3359 54.7399 72.1213 93.2983 112.9700 130.3967 161.5909 169.9990 206.0211 207.5423 225.8039 239.1053 243.7035 266.8299 297.0091 345.1425 352.0218 360.5661 400.6543 409.4297 414.6672 427.3434 462.4834 469.3728 509.6057 525.9561 551.8163 563.1593 608.2729 628.1324 636.5574 689.7280 692.6252 719.4050 740.6521 747.1874 771.0216 809.2506 810.2940 821.5628 832.9984 861.3798 881.9707 890.0224 916.0755 936.2064 940.6064 953.4210 969.9487 986.3217 987.6853 994.7657 1004.4513 1011.9161 1052.3504 1112.1868 1112.5218 1116.6474 1119.2053 1155.3792 1157.7442 1175.9034 1183.9214 1191.4723 1219.2560 1220.0801 1253.2269 1276.7328 1290.5893 1306.5463 1310.9664 1329.8417 1370.5530 1375.1694 1384.4273 1394.3141 1412.8687 1421.6937 1436.8416 1465.5334 1466.2735 1467.5488 1472.6921 1477.6332 1485.3334 1496.6333 1503.4978 1506.8815 1520.3658 1593.7036 1597.6266 1626.8324 1633.4010 1648.7572 2956.5953 2973.0828 2975.4080 2977.4125 3042.8883 3065.7376 3072.5070 3076.6319 3081.0269 3097.6009 3107.3098 3122.9016 3123.7089 3130.1792 3156.7326 3167.7578 3194.0835 3196.6304 3519.1534 3531.7986
redmass: 5.4405 3.2709 3.0274 4.8587 4.3712 6.5299 3.4146 3.5120 4.1490 3.3116 4.7234 1.0837 2.7872 2.8159 1.1751 1.5228 2.3517 3.7305 5.4235 2.8609 4.4193 3.1529 2.9440 3.0839 4.5873 2.1110 3.4440 3.8320 2.3565 2.3065 3.9219 1.1874 7.0824 7.0157 4.1368 11.7832 3.6691 3.4619 4.8653 6.7680 6.0077 1.3253 1.4254 1.5801 1.4503 5.4313 2.6521 1.1856 1.3652 1.3716 1.4730 1.3102 8.5767 1.3254 4.2446 3.1951 3.1125 1.5196 1.2606 2.5405 1.3422 1.4968 1.6902 1.3323 1.7625 1.5878 1.1340 2.2000 2.0254 2.4373 1.9836 1.6408 1.5183 1.3203 1.9680 4.1849 1.1967 3.1266 1.2195 3.4384 3.9997 1.1743 1.0479 1.0498 1.0475 1.0808 1.0506 1.1184 1.9786 2.2913 2.2497 2.7566 5.0601 5.8432 6.2114 6.4274 3.8295 1.0331 1.0348 1.0392 1.0800 1.1039 1.1000 1.0992 1.1004 1.0996 1.0877 1.0901 1.0992 1.0906 1.0952 1.0897 1.0945 1.0940 1.0944 1.0765 1.0755
irintensity: 0.7505 0.2750 1.3246 0.0842 0.1227 11.0768 7.8169 0.2607 5.6659 1.0621 1.1570 0.0084 3.9848 0.0977 0.0043 0.0802 3.2487 0.1775 7.1333 2.4907 0.2609 1.7749 0.0019 0.0039 8.6586 0.6017 0.7789 24.2243 31.4766 36.0607 4.0452 132.5928 4.9218 0.2462 9.3148 17.6910 0.0018 1.5317 5.5645 5.6008 1.6481 15.4765 39.8833 91.3911 45.1620 0.3675 1.9161 3.2744 0.2993 0.3474 0.0578 4.0864 43.6188 3.7629 0.3388 20.1711 7.6520 40.3343 0.1826 1.6740 5.0507 33.0612 2.3400 0.3612 340.5839 45.6009 31.9428 268.0833 108.1919 88.8415 32.0498 4.9693 13.6092 0.9633 155.4407 78.8992 15.6119 150.8347 18.3669 33.2207 50.3023 38.0404 5.7289 13.1116 0.3145 77.5517 13.8396 4.2431 123.9357 225.6775 1357.0398 4.5185 49.7952 16.6939 37.5777 4.4268 99.3607 75.0509 32.7380 42.4479 24.3178 51.6212 0.0214 121.9806 26.1192 41.1586 27.5888 23.4540 29.6492 27.6523 17.5316 12.0671 7.4474 6.5256 7.6375 9.5544 14.3266
temp: 298.150 k
press: 1.00000 atm
elementType: 8 8 7 7 6 6 6 6 6 6 6 6 6 6 6 6 6 6 6 6 6 1 1 1 1 1 1 1 1 1 1 1 1 1 1 1 1 1 1 1 1
symmnumber: 1
zpe: 880258.0 jmol-1
zpe.correction: 0.335273 hartree
zpe.thermalcorrener: 0.356001 hartree
zpe.thermalcorrenthalpy: 0.356946 hartree
zpe.thermalcorrgfe: 0.283948 hartree
zpe.sumelectzpe: -918.240774 hartree
zpe.sumelectthermal: -918.220046 hartree
zpe.sumelectthermalent: -918.219101 hartree
zpe.sumelectthermalfe: -918.292099 hartree
dipole: -0.1487 2.3444 -0.0009
dipole: 2.3491
quadrupole: -110.2016 -105.2133 -132.4224
quadrupole: -10.6832 -0.0008 -0.0030
quadrupole: 5.7442 10.7325 -16.4767 -10.6832 -0.0008 -0.0030
hfenergy: -918.576047 hartree
pointgroup: C01 [X(C17H20N2O2)]
dipole: -0.0553647 -0.9225551 0.0003721 debye
polarizability: 390.4631712|4.751057|199.6701925|-0.0048375|-0.0094746|106.2311251 unknown
InChI: InChI=1S/C17H20N2O2/c1-12(2)13-4-6-14(7-5-13)18-17(20)19-15-8-10-16(21-3)11-9-15/h4-12,18-19H,1-3H3
charge 0 multiplicity 1
41 atoms
O  6.997333 0.472009 -0.000119
O  0.336575 0.980872 -0.000015
N  -0.794389 -1.092119 0.000396
N  1.537383 -1.048641 0.000461
C  -6.430372 0.36132 0.000117
C  -4.94226 0.001786 0.000188
C  -6.828552 1.149235 -1.277046
C  -6.828589 1.149581 1.277054
C  -4.517046 -1.349778 0.000384
C  -3.935749 1.001813 0.000057
C  -2.155357 -0.672973 0.000315
C  -3.148786 -1.687925 0.000445
C  -2.561567 0.688636 0.000117
C  0.358217 -0.285056 0.000263
C  2.882093 -0.574323 0.000282
C  3.916542 -1.55238 0.000191
C  3.234778 0.797993 0.000232
C  5.617064 0.200367 0.00002
C  5.267677 -1.173001 0.000069
C  4.595256 1.179601 0.000092
C  7.401838 1.878959 -0.00007
H  -7.003077 -0.588588 0.000234
H  -6.294136 2.116249 -1.327147
H  -7.914008 1.362426 -1.281744
H  -6.581248 0.579801 -2.1910
H  -6.581313 0.580395 2.191169
H  -7.914044 1.362778 1.281662
H  -6.294169 2.116606 1.326906
H  -5.266328 -2.151046 0.00049
H  -4.225205 2.059884 -0.000101
H  -2.851014 -2.745642 0.000594
H  -1.802663 1.472491 0.000007
H  -0.665941 -2.106228 0.000587
H  1.448109 -2.066728 0.000676
H  3.66184 -2.620718 0.000206
H  2.445892 1.551599 0.000266
H  6.066192 -1.920766 0.000001
H  4.836207 2.246907 0.000042
H  7.036236 2.40386 0.904352
H  7.036181 2.403937 -0.904426
H  8.501702 1.86301 -0.000108
