program: Gaussian 09
title: 000292884
version: EM64L-G09RevD.01
frameworkgroup: C1[X(C12H14N4O3)]
method: RPBEPBE
basis: SDD
operation: Freq
keyword: #p
keyword: freq=noraman
keyword: PBEPBE/SDD
title: #p freq=noraman PBEPBE/SDD
converged: NO YES NO NO
title: Mulliken charges:
elementType: O O O N N N N C C C C C C C C C C C C H H H H H H H H H H H H H H
charge: -0.306753 -0.303006 -0.286419 -0.008906 -0.216018 -0.102772 -0.106157 0.533802 0.049563 0.301426 0.249111 -0.546639 -0.558252 -0.321811 -0.525805 -0.526832 -0.508558 -0.149571 -0.133782 0.293535 0.254548 0.218385 0.261785 0.234352 0.232185 0.235197 0.227050 0.251754 0.233478 0.255364 0.216313 0.286152 0.267284
chargesum: 0.00000
title: Mulliken charges with hydrogens summed into heavy atoms:
elementType: O O O N N N N C C C C C C C C C C C C
charge: -0.306753 -0.303006 -0.286419 -0.008906 -0.216018 -0.102772 -0.106157 0.533802 0.049563 0.301426 0.249111 -0.253105 -0.303704 -0.103427 0.202517 0.187169 0.196597 0.136581 0.133502
polarizability: 3.29047771e+02 5.33141234e+00 1.77785923e+02 -1.51822279e+00 2.91673812e-02 8.89664239e+01
1716.lowfreq: -44.9550 -9.1766 -0.0006 0.0006 0.0007 2.7397 6.0402 21.6921 40.9212
frequency: -44.8061 21.6864 40.8636 57.4258 79.0097 81.7589 106.1679 108.5465 143.5310 155.8593 161.7171 165.6025 191.7051 207.1771 237.9930 253.0226 262.0737 281.2015 326.9070 352.0687 371.8589 422.2782 448.6151 503.8666 508.4067 582.7858 596.7182 614.2497 638.5773 640.3583 654.9509 714.6369 743.3860 767.7053 790.0791 801.6666 864.9551 875.6081 877.1739 896.1254 907.6843 918.1944 934.2538 963.5433 1017.4687 1019.9079 1041.1012 1108.3771 1110.3452 1111.7207 1115.8158 1131.1926 1148.8339 1155.0547 1158.5980 1169.5817 1191.5386 1211.2272 1236.0236 1269.2533 1309.3609 1350.6830 1374.4221 1395.3291 1405.9907 1417.0480 1427.3619 1437.0586 1440.1917 1451.2892 1458.1557 1460.7358 1467.7785 1475.7474 1477.7199 1486.5397 1556.8524 1589.1433 1604.6446 2978.8886 2983.4002 2985.3399 3031.9300 3078.1149 3085.6034 3095.6294 3127.5014 3128.4275 3135.3080 3152.2290 3182.6284 3256.4510 3265.7510
redmass: 1.3913 4.1690 5.3205 6.0396 3.7749 3.3970 3.9159 2.6607 2.5658 1.5002 1.6853 1.2477 4.2242 3.4193 5.1768 4.6439 4.0148 5.0430 4.2771 7.6777 5.4924 6.4332 5.7156 5.7759 5.6767 7.1375 4.7105 2.8091 4.6555 6.9395 3.5277 6.2007 1.3745 3.8687 5.8231 1.5334 3.4534 2.1059 6.5644 8.6689 1.7697 3.9449 9.2677 1.6138 3.2712 3.4281 5.7070 1.2443 1.4184 1.9035 1.2714 2.4543 1.3587 1.5451 1.4613 1.3918 2.1822 1.4124 5.7144 4.8359 2.8936 4.2147 3.9353 3.6304 2.1539 1.6094 2.3308 1.3202 1.4132 1.1120 1.0577 1.1172 2.4014 1.0549 1.0811 1.0574 7.5693 6.0033 6.7535 1.0309 1.0296 1.0341 1.0886 1.1036 1.1054 1.0975 1.1031 1.1037 1.1056 1.0917 1.0925 1.0974 1.1023
irintensity: 2.9563 0.0914 0.2298 1.5390 1.9202 7.2894 4.6600 5.0268 5.4335 2.2117 1.6487 1.4125 2.2632 6.7182 12.9326 2.8374 6.2496 13.6681 9.5829 8.5771 3.4772 13.8396 7.4834 10.6034 8.0372 28.0059 0.4573 9.6540 5.0375 0.2024 33.9646 0.9242 7.2223 6.2287 16.2689 39.1287 5.9071 11.0972 5.0585 0.7915 9.3463 52.8622 77.1976 44.3798 86.3172 149.0714 174.0522 6.4807 7.7883 93.2917 5.5414 72.0560 3.5354 12.2465 16.8879 5.2071 35.2091 12.6195 6.4489 12.3834 326.3125 41.9552 13.9399 66.0789 29.6906 60.2374 154.7379 58.2017 33.8903 11.1786 16.3845 4.7189 14.9200 7.2083 23.1369 27.0842 113.4090 24.8542 4.1462 69.7411 66.4577 81.0175 31.6397 24.8485 17.8327 40.4527 18.6715 21.9439 14.6061 2.0117 2.1465 1.1036 1.0566
temp: 298.150 k
press: 1.00000 atm
elementType: 8 8 8 7 7 7 7 6 6 6 6 6 6 6 6 6 6 6 6 1 1 1 1 1 1 1 1 1 1 1 1 1 1
symmnumber: 1
zpe: 655202.4 jmol-1
zpe.correction: 0.249553 hartree
zpe.thermalcorrener: 0.267819 hartree
zpe.thermalcorrenthalpy: 0.268763 hartree
zpe.thermalcorrgfe: 0.201616 hartree
zpe.sumelectzpe: -908.819552 hartree
zpe.sumelectthermal: -908.801286 hartree
zpe.sumelectthermalent: -908.800342 hartree
zpe.sumelectthermalfe: -908.867489 hartree
dipole: -9.6555 -0.2282 -1.0189
dipole: 9.7118
quadrupole: -151.0483 -102.9918 -108.7674
quadrupole: -4.0487 0.3835 0.1374
quadrupole: -30.1125 17.9440 12.1684 -4.0487 0.3835 0.1374
hfenergy: -909.0691051 hartree
pointgroup: C01 [X(C12H14N4O3)]
dipole: 3.7769503 -0.0850242 0.5716324 debye
polarizability: 328.6604093|-5.6897292|177.6687758|9.2828808|-3.9216061|89.4709326 unknown
InChI: InChI=1S/C12H14N4O3/c1-17-10-4-9(5-11(18-2)12(10)19-3)6-15-16-7-13-14-8-16/h4-8H,1-3H3
charge 0 multiplicity 1
33 atoms
O  3.980444 0.111131 0.02264
O  2.206323 2.392394 0.005191
O  2.778961 -2.542279 0.192438
N  -2.524497 0.371871 -0.116239
N  -3.898079 0.092543 -0.173576
N  -6.085831 0.629395 -0.316806
N  -5.964878 -0.806913 -0.238284
C  -0.239695 -0.405868 0.04012
C  2.580213 -0.052305 0.090113
C  1.699874 1.077353 0.071039
C  2.025836 -1.362217 0.174901
C  0.308419 0.905853 0.025561
C  0.622314 -1.52666 0.140406
C  -1.686128 -0.63953 -0.019853
C  4.460987 0.688171 -1.262439
C  3.047465 2.812018 1.152856
C  3.973754 -2.615477 1.062921
C  -4.83807 1.122531 -0.274262
C  -4.653119 -1.092673 -0.154637
H  -0.344695 1.78078 -0.017182
H  0.229047 -2.548207 0.179323
H  -2.009727 -1.694868 0.018301
H  4.00095 1.676307 -1.438517
H  4.220335 0.000842 -2.0936
H  5.551399 0.78168 -1.148794
H  3.372566 3.834977 0.911402
H  2.442747 2.817988 2.07889
H  3.918661 2.144187 1.273677
H  4.253193 -3.679875 1.056295
H  4.789388 -1.987134 0.674663
H  3.721288 -2.297178 2.092189
H  -4.551483 2.168914 -0.311889
H  -4.24426 -2.095645 -0.083048
