program: Gaussian 09
title: 000286578
version: EM64L-G09RevD.01
frameworkgroup: C1[X(C14H13N5O)]
method: RPBEPBE
basis: SDD
operation: Freq
keyword: #p
keyword: freq=noraman
keyword: PBEPBE/SDD
title: #p freq=noraman PBEPBE/SDD
converged: NO NO NO NO
title: Mulliken charges:
elementType: O N N N N N C C C C C C C C C C C C C C H H H H H H H H H H H H H
charge: -0.183981 -0.140123 -0.094143 -0.033560 -0.399996 0.013302 -0.579033 0.159953 -0.123236 0.499215 -0.213162 0.206632 -0.415981 -0.357830 -0.373940 -0.221387 -0.228072 -0.232493 0.216077 -0.797913 0.262669 0.229144 0.268384 0.227559 0.268500 0.350197 0.250940 0.229458 0.232057 0.233182 0.240141 0.267725 0.239715
chargesum: 0.00000
title: Mulliken charges with hydrogens summed into heavy atoms:
elementType: O N N N N N C C C C C C C C C C C C C C
charge: -0.183981 -0.140123 -0.094143 -0.033560 -0.049799 0.013302 -0.087219 0.159953 -0.123236 0.499215 0.055221 0.206632 -0.188422 -0.089329 -0.123000 0.008071 0.003985 0.000688 0.216077 -0.050332
polarizability: 2.62648867e+02 -1.90901175e+01 1.82468597e+02 -4.83713013e+00 3.98222799e+00 1.23629394e+02
1716.lowfreq: -19.8242 -2.9584 -1.5155 -0.0004 -0.0002 0.0002 9.4854 25.5133 35.9367
frequency: -9.5302 25.4792 35.9297 46.0601 61.2885 76.1688 98.1482 135.3279 187.0478 189.3685 209.9863 240.9315 276.1361 318.1784 328.5742 348.4639 403.7703 458.7499 512.0402 521.6703 543.6760 547.0760 575.4707 599.4249 616.0798 640.1311 653.4155 664.2108 702.8675 718.4444 741.2194 764.9906 781.7828 802.1387 813.6200 833.7767 846.0216 860.4715 867.7730 926.1465 926.5786 951.8536 969.5084 983.8610 990.1485 1003.2868 1018.5452 1026.8985 1032.5302 1083.0668 1110.9600 1127.9998 1174.8580 1185.9609 1191.7527 1200.9455 1213.0588 1231.3187 1279.9563 1301.9181 1312.3291 1337.9105 1358.9991 1361.2683 1369.3261 1374.0938 1385.3367 1418.7670 1437.9140 1443.2301 1450.8126 1466.2952 1466.7330 1484.3691 1496.3139 1547.7929 1579.5748 1595.8020 1614.5514 1663.0041 2987.5005 3022.4293 3073.0207 3082.5716 3114.6177 3125.2387 3136.0559 3140.9908 3149.1062 3165.8610 3172.2118 3232.1476 3484.3498
redmass: 5.0744 6.0888 4.2002 3.1751 1.8715 2.1416 4.7556 5.5082 4.8076 5.6926 6.5969 7.5568 5.3788 3.8512 4.5197 2.3987 2.8240 3.7605 4.9038 6.0492 6.0055 3.5156 3.1671 4.5769 6.3557 5.0375 5.9803 5.0154 3.2270 1.7480 1.2922 5.9581 3.1536 4.2098 2.8650 2.0022 6.5645 1.2465 5.7288 1.4459 1.5148 1.8128 2.3542 1.3824 6.2032 1.3223 3.4831 2.2538 1.6930 1.7189 4.3119 2.3515 1.0551 2.0732 1.1710 2.7168 2.7183 2.2582 7.5373 5.5015 1.9904 1.4895 1.7849 2.0158 2.1085 1.2338 6.3048 3.1566 2.1074 2.1387 1.2901 1.2127 1.0676 2.2048 2.2681 8.9718 4.6176 6.0563 5.9712 5.7152 1.0381 1.0593 1.0982 1.1050 1.0882 1.0875 1.0911 1.0983 1.0958 1.1015 1.0923 1.0985 1.0767
irintensity: 1.1545 0.1946 1.3564 5.1975 0.0623 1.6552 5.3190 0.8622 0.4939 0.0932 0.6320 1.8643 0.9848 0.6880 0.7261 0.7241 0.2314 4.4500 18.0415 9.3020 2.8555 3.4938 0.1382 0.0164 0.1189 21.8765 28.8812 13.6889 2.6305 150.1600 65.3016 1.6847 3.6445 29.0002 9.3577 2.6818 2.6559 0.3341 3.5000 10.9067 1.1026 14.9708 31.0095 0.5317 0.2692 1.0304 22.2994 10.4008 9.3879 18.3789 0.5665 12.3663 0.0769 6.6310 7.4954 259.9140 17.0984 18.3792 35.7422 68.9998 96.2923 64.7374 19.7221 46.1703 2.5263 65.5980 4.1016 472.6624 15.9288 9.3292 39.1774 58.8903 12.9689 36.8957 30.0188 183.0645 567.2568 1.6530 1.7192 131.3867 5.8577 27.0929 13.5795 4.0607 9.6769 0.0429 6.6560 9.4851 27.0732 25.4917 12.5670 0.0178 29.1633
temp: 298.150 k
press: 1.00000 atm
elementType: 8 7 7 7 7 7 6 6 6 6 6 6 6 6 6 6 6 6 6 6 1 1 1 1 1 1 1 1 1 1 1 1 1
symmnumber: 1
zpe: 664092.5 jmol-1
zpe.correction: 0.252939 hartree
zpe.thermalcorrener: 0.269043 hartree
zpe.thermalcorrenthalpy: 0.269988 hartree
zpe.thermalcorrgfe: 0.207031 hartree
zpe.sumelectzpe: -888.882008 hartree
zpe.sumelectthermal: -888.865904 hartree
zpe.sumelectthermalent: -888.864960 hartree
zpe.sumelectthermalfe: -888.927916 hartree
dipole: 4.7343 -4.5873 -0.1019
dipole: 6.5929
quadrupole: -114.8761 -114.4933 -111.6071
quadrupole: 13.3500 -0.3770 2.4875
quadrupole: -1.2173 -0.8345 2.0518 13.3500 -0.3770 2.4875
hfenergy: -889.1349472 hartree
pointgroup: C01 [X(C14H13N5O1)]
dipole: -1.8382888 -1.8260504 -0.1198632 debye
polarizability: 262.1165427|20.5047986|183.2456482|-3.095751|1.2111736|123.3846673 unknown
InChI: InChI=1S/C14H13N5O/c1-10(20)18-13-12-14(16-8-15-13)19(9-17-12)7-11-5-3-2-4-6-11/h2-6,8-9,18H,7H2,1H3
charge 0 multiplicity 1
33 atoms
O  5.27466 1.176829 -0.551726
N  -0.845317 -0.777104 1.018747
N  0.959138 -1.881627 0.114465
N  0.161259 1.48718 1.253551
N  3.573179 -0.460896 -0.402034
N  2.50323 1.535914 0.4776
C  -2.21823 -0.505764 1.51005
C  0.179719 0.168949 0.91107
C  1.283827 -0.533843 0.355497
C  -3.203725 -0.182941 0.391583
C  -0.324383 -1.977031 0.517907
C  2.477609 0.213435 0.144372
C  -4.204313 -1.112597 0.018249
C  -3.124767 1.062035 -0.28433
C  1.364006 2.091144 1.00522
C  -5.112691 -0.80924 -1.022203
C  -4.029809 1.36461 -1.324331
C  -5.025356 0.429739 -1.696664
C  4.87593 0.000222 -0.721513
C  5.75131 -1.112298 -1.306332
H  -2.125959 0.348195 2.204185
H  -2.552326 -1.387092 2.084855
H  -0.919889 -2.886614 0.473792
H  -4.279142 -2.073594 0.543768
H  -2.354941 1.785709 0.010305
H  3.377633 -1.450469 -0.593925
H  1.432346 3.153269 1.256763
H  -5.884906 -1.534048 -1.302745
H  -3.96287 2.328065 -1.841572
H  -5.728092 0.666804 -2.50318
H  5.873958 -1.941632 -0.584878
H  6.739707 -0.69387 -1.541544
H  5.305501 -1.525344 -2.230401
