program: Gaussian 09
title: 000286563
version: EM64L-G09RevD.01
frameworkgroup: C1[X(C7H5Cl2NO2)]
method: RPBEPBE
basis: SDD
operation: Freq
keyword: #p
keyword: freq=noraman
keyword: PBEPBE/SDD
title: #p freq=noraman PBEPBE/SDD
converged: YES YES NO NO
title: Mulliken charges:
elementType: Cl Cl O O N C C C C C C C H H H H H
charge: -0.000007 -0.048725 -0.198885 -0.198204 0.020881 0.671442 -0.485732 0.406867 -0.328096 -0.359681 -0.756799 -0.156522 0.299228 0.297068 0.287368 0.279766 0.270032
chargesum: 0.00000
title: Mulliken charges with hydrogens summed into heavy atoms:
elementType: Cl Cl O O N C C C C C C C
charge: -0.000007 -0.048725 -0.198885 -0.198204 0.020881 0.671442 -0.186504 0.406867 -0.328096 -0.062613 -0.189666 0.113510
polarizability: 1.65345148e+02 -3.89678282e+00 1.17863939e+02 -2.83668314e+00 -8.52255156e+00 5.79195420e+01
1716.lowfreq: -7.6569 -1.5324 -0.0025 -0.0016 0.0019 8.6964 37.7815 54.2668 86.4781
frequency: 37.7737 54.2658 86.4773 101.9737 177.6970 226.4107 255.2387 299.6527 307.0238 372.1007 445.3129 493.9687 510.1159 532.8001 570.4829 624.3652 676.1508 706.3247 736.6554 756.0029 842.5839 895.9065 919.3734 946.5793 983.7132 1028.7345 1091.5880 1121.5631 1142.7199 1209.3722 1223.3100 1256.7150 1265.0712 1369.7271 1393.0602 1415.6752 1456.5420 1460.0378 1577.9371 1607.1833 3077.5001 3159.8899 3171.4692 3173.2882 3192.8610
redmass: 12.9222 16.0050 11.9847 7.8684 9.3772 6.7913 3.8066 16.6660 6.7365 4.3084 3.4192 6.1695 6.3067 5.5479 6.7463 6.9851 7.5534 5.8365 4.9724 8.2345 1.3954 2.3570 2.2560 1.5316 1.3454 6.2423 1.8924 1.3560 1.1810 4.8445 3.6603 1.1671 1.3696 8.9929 6.7639 4.1578 1.7689 1.5505 6.9341 8.2711 1.0577 1.1112 1.0925 1.0901 1.0971
irintensity: 1.2188 0.1035 3.1875 1.1403 3.3887 3.2768 2.2980 0.8680 2.2099 2.1537 3.1277 11.9528 10.0270 15.1898 12.5989 46.2653 2.3116 8.6201 9.1717 18.8906 31.9115 23.0152 6.0672 20.5200 1.2709 86.7751 3.1533 8.5090 12.6231 190.4172 138.5024 10.5844 10.3600 103.3051 4.1848 32.5749 35.4756 15.7613 50.5092 19.8855 12.3996 0.8984 3.0070 1.5938 2.9860
temp: 298.150 k
press: 1.00000 atm
elementType: 17 17 8 8 7 6 6 6 6 6 6 6 1 1 1 1 1
symmnumber: 1
zpe: 286823.8 jmol-1
zpe.correction: 0.109245 hartree
zpe.thermalcorrener: 0.120142 hartree
zpe.thermalcorrenthalpy: 0.121086 hartree
zpe.thermalcorrgfe: 0.070308 hartree
zpe.sumelectzpe: -1394.115593 hartree
zpe.sumelectthermal: -1394.104697 hartree
zpe.sumelectthermalent: -1394.103752 hartree
zpe.sumelectthermalfe: -1394.154531 hartree
dipole: -2.2203 2.3244 1.5871
dipole: 3.5849
quadrupole: -104.2967 -80.3755 -80.9674
quadrupole: 3.4705 -3.6494 -4.1897
quadrupole: -15.7502 8.1711 7.5791 3.4705 -3.6494 -4.1897
hfenergy: -1394.2248386 hartree
pointgroup: C01 [X(C7H5Cl2N1O2)]
dipole: 0.9272391 -0.8275916 0.6667809 debye
dipolederiv: -0.7386176 0.2716871 -0.0368085 0.2457184 -0.1866581 -0.0022219 -0.0344876 -0.0002649 -0.0350069 -0.3524682 -0.208423 0.0699363 -0.227169 -0.3463536 0.0814842 0.2519726 0.2499492 -0.3427968 -0.8633773 -0.1550073 -0.0742746 -0.1426822 -0.5234431 -0.0777245 -0.0876611 -0.0769264 -0.2464207 -0.6207835 0.1584469 0.0084196 0.2137576 -0.741365 -0.0998391 0.00744 -0.0979115 -0.2405436 1.8143087 -0.1755961 0.079135 -0.266573 1.0819455 0.1811268 0.0959977 0.1702414 0.2348773 -0.3099918 0.212424 -0.0053399 0.2563682 -0.1778234 -0.0078343 -0.0673519 -0.0918548 -0.079562 0.2316314 -0.1590525 0.0011076 0.1171026 -0.0698122 0.0262808 0.0628074 -0.0167031 -0.0921819 -0.635556 0.1755004 -0.0219203 0.1999178 -0.0851659 -0.0055775 -0.0265734 -0.018212 0.0716191 1.1445174 -0.4631028 0.0742656 -0.3254355 0.3388106 0.0219707 0.0553057 0.0328603 -0.0538621 0.1572694 -0.001423 0.0393788 -0.3112236 0.0353158 0.0095983 -0.0391804 0.0287005 -0.0959925 0.3962263 0.2958296 -0.1415271 0.2777605 0.4123956 -0.1486531 -0.2263242 -0.2146045 0.4778614 -0.5547773 0.0189665 -0.0410349 -0.0578812 0.0629543 0.0175768 -0.0628686 0.0331585 -0.0697447 0.1331651 0.024429 -0.0079597 -0.0092599 0.0537712 -0.0212358 -0.0028272 -0.0168134 0.1531733 0.0856562 -0.0486696 -0.0199804 -0.0123017 0.1043855 -0.0151872 -0.0092842 -0.0178389 0.16946 -0.0085052 -0.0301584 -0.0233065 0.0398444 0.0578773 0.0975381 0.0158995 0.0689405 0.0070067 0.0447484 0.0484246 0.0997584 -0.0228768 -0.0169291 -0.0315304 0.0695922 -0.0041037 -0.0128333 0.0765538 0.0357247 0.0001506 0.0249334 0.0000948 -0.0257717 -0.0024566 -0.0286172 0.1549468 unknown
polarizability: 165.6400567|-1.7288151|118.6206961|-0.3482246|3.8507875|56.8678759 unknown
InChI: InChI=1S/C7H5Cl2NO2/c8-4-5-3-6(10(11)12)1-2-7(5)9/h1-3H,4H2
charge 0 multiplicity 1
17 atoms
Cl 3.135806 -1.604332 0.133223
Cl 2.942132 2.119036 -0.975845
O  -3.530439 -0.526604 -0.283588
O  -2.841557 1.588935 0.22522
N  -2.613858 0.341782 -0.01637
C  1.164505 0.382434 0.341269
C  -0.18615 0.802518 0.298367
C  -1.205593 -0.126683 0.016556
C  1.429167 -0.991734 0.092526
C  -0.93171 -1.488915 -0.23185
C  2.245977 1.377662 0.639733
C  0.406892 -1.92124 -0.19105
H  -0.450266 1.849176 0.475979
H  -1.751792 -2.177995 -0.447647
H  3.119702 0.931125 1.132469
H  1.871575 2.244175 1.200912
H  0.65791 -2.968939 -0.376103
