program: Gaussian 09
title: 000286562
version: EM64L-G09RevD.01
frameworkgroup: C1[X(C7H5ClN2O3)]
method: RPBEPBE
basis: SDD
operation: Freq
keyword: #p
keyword: freq=noraman
keyword: PBEPBE/SDD
title: #p freq=noraman PBEPBE/SDD
converged: YES YES NO NO
title: Mulliken charges:
elementType: Cl O O O N N C C C C C C C H H H H H
charge: -0.035737 -0.266777 -0.200824 -0.185333 0.022674 -0.622212 0.388687 0.405066 -0.463351 -0.288138 -0.356799 -0.161911 0.185515 0.341888 0.298645 0.269804 0.323224 0.345580
chargesum: 0.00000
title: Mulliken charges with hydrogens summed into heavy atoms:
elementType: Cl O O O N N C C C C C C C
charge: -0.035737 -0.266777 -0.200824 -0.185333 0.022674 0.046591 0.388687 0.405066 -0.121463 -0.288138 -0.058154 0.107893 0.185515
polarizability: 1.69837981e+02 -2.18719749e+00 1.29008933e+02 3.99152729e-01 -6.65704807e-02 4.16435422e+01
1716.lowfreq: 0.0020 0.0023 0.0028 2.9756 8.7567 11.4607 20.5057 49.6979 81.4736
frequency: 20.1214 49.6917 81.4719 149.6977 153.7305 233.3607 279.7066 293.4286 307.8214 348.7444 431.5415 465.3460 486.6553 504.5784 560.9632 567.4888 595.6207 611.9324 667.7353 675.2207 716.0811 732.2600 765.5767 841.4088 853.7159 984.0029 997.7019 1009.7014 1068.0877 1091.6238 1123.6400 1140.7748 1212.7189 1243.6024 1336.6224 1372.1937 1379.4088 1414.8174 1443.9706 1561.2302 1585.3559 1608.7272 1636.8389 3164.9688 3172.4227 3193.0001 3499.8264 3654.9301
redmass: 5.8380 14.5491 9.0665 5.0717 11.0310 15.4791 7.1914 15.4989 7.6459 5.3750 3.1323 8.9606 3.3575 8.0362 1.2492 4.1624 5.0421 1.5956 6.7959 2.8706 4.8280 9.3674 5.9001 1.4137 6.9257 1.3718 1.3918 7.4717 1.6847 1.7164 4.9330 1.4387 7.3982 1.4549 3.4063 6.9760 10.4126 5.3595 2.8251 4.5499 2.7154 5.7771 2.1793 1.0913 1.0898 1.0973 1.0459 1.1041
irintensity: 10.4126 0.0151 2.8904 0.2388 0.5597 5.2648 3.2645 1.6409 11.8934 5.0044 3.5806 11.0842 7.3438 12.9732 66.5822 21.1345 6.4350 133.4206 3.8787 110.3410 3.3244 11.0904 10.6333 33.1093 33.6678 7.5007 18.1087 66.8926 8.4540 12.2132 4.6610 11.3129 303.5610 8.2307 65.4786 22.8142 208.8374 37.4789 17.3244 54.8824 99.1092 12.3824 290.1013 23.8591 2.1128 2.8910 41.4406 97.1754
temp: 298.150 k
press: 1.00000 atm
elementType: 17 8 8 8 7 7 6 6 6 6 6 6 6 1 1 1 1 1
symmnumber: 1
zpe: 306782.7 jmol-1
zpe.correction: 0.116847 hartree
zpe.thermalcorrener: 0.128256 hartree
zpe.thermalcorrenthalpy: 0.129200 hartree
zpe.thermalcorrgfe: 0.077351 hartree
zpe.sumelectzpe: -1063.981189 hartree
zpe.sumelectthermal: -1063.969780 hartree
zpe.sumelectthermalent: -1063.968836 hartree
zpe.sumelectthermalfe: -1064.020685 hartree
dipole: 5.3344 -3.8459 0.1510
dipole: 6.5779
quadrupole: -86.0704 -85.6888 -81.7145
quadrupole: 5.9717 0.4705 0.3568
quadrupole: -1.5792 -1.1975 2.7767 5.9717 0.4705 0.3568
hfenergy: -1064.0980363 hartree
pointgroup: C01 [X(C7H5Cl1N2O3)]
dipole: -1.8596318 1.7074468 0.5691354 debye
dipolederiv: -0.6865395 0.2696261 0.1429646 0.2284782 -0.292252 -0.0645362 0.1421388 -0.0696825 -0.0720075 -0.6589766 -0.095706 0.055075 0.0751732 -0.9634615 -0.0990946 0.0758171 -0.0547067 -0.3873134 -0.8391092 -0.1593745 0.0969505 -0.1116081 -0.5313681 -0.0078948 0.1012155 0.0003888 -0.2445046 -0.5770202 0.141126 0.0799847 0.1383684 -0.7300963 -0.0734337 0.0796692 -0.0739304 -0.2331277 1.6565354 -0.138919 -0.2804099 -0.2150902 1.1060055 0.1240038 -0.2887353 0.1105156 0.2536765 -1.126611 0.0996392 0.1151565 -0.0058701 -0.4175884 0.0343028 0.1056719 0.0105785 -0.6932527 -0.4084899 0.0800241 0.0958081 -0.0581234 -0.4286399 -0.0394065 0.0779675 -0.0692309 0.043426 -0.4615532 0.1303016 0.1059023 0.1900286 -0.0887863 -0.0476079 0.1128607 -0.0360346 0.028406 0.1656577 -0.1124004 -0.0517775 0.0882276 -0.1258052 -0.0232515 -0.0380726 0.0128379 -0.0532398 1.0006659 -0.5004675 -0.2394307 -0.2500034 0.4766458 0.0957737 -0.2146681 0.1464315 -0.0143934 0.124065 0.0413606 -0.0355445 -0.3089089 0.0456413 0.069255 -0.069557 0.0050226 -0.0814594 -0.5536646 0.0129284 0.0873463 -0.0187929 0.0301415 0.0142301 0.0871882 0.008143 -0.0935003 1.4957831 0.1708274 -0.2578839 0.0833597 1.2003745 0.115901 -0.2621033 0.0872206 0.3108376 0.1939103 0.03995 -0.0003646 0.0445355 0.1664908 -0.0076143 0.0028902 -0.0068598 0.1699357 0.0893412 -0.0531171 0.0104585 -0.0189529 0.1055563 -0.0032459 0.0141973 0.0035349 0.1733349 0.0805385 0.0279856 0.017095 0.0149613 -0.0095613 -0.0194051 0.0161703 -0.0209096 0.1573758 0.2626901 0.0450559 0.0283645 0.1063853 0.3022027 -0.0355623 0.0276932 -0.0237138 0.3631905 0.242777 0.0011594 0.0303052 0.0178322 0.1545006 -0.0324136 0.0296562 -0.0296052 0.3726157 unknown
polarizability: 164.4861567|-4.6129452|129.0570774|-23.3778948|9.5196475|46.9472226 unknown
InChI: InChI=1S/C7H5ClN2O3/c8-6-2-1-4(10(12)13)3-5(6)7(9)11/h1-3H,9H2
charge 0 multiplicity 1
18 atoms
Cl -2.637099 1.93627 0.805104
O  -1.597132 -2.603542 0.129271
O  3.813935 0.419347 -0.512641
O  2.967021 -1.699281 -0.557837
N  2.842024 -0.425563 -0.415379
N  -3.246461 -1.090192 0.682048
C  -0.900426 -0.291894 0.277443
C  1.489041 0.116933 -0.118138
C  0.407165 -0.76816 -0.007631
C  -1.038344 1.112737 0.438212
C  1.33653 1.510617 0.044039
C  0.052257 2.00452 0.324481
C  -1.947296 -1.405018 0.357808
H  0.53617 -1.847329 -0.139137
H  2.200709 2.172529 -0.049383
H  -0.111502 3.07727 0.456202
H  -3.565227 -0.140401 0.870453
H  -3.906868 -1.86644 0.725487
