program: Gaussian 09
title: 000286575
version: EM64L-G09RevD.01
frameworkgroup: C1[X(C14H14O7)]
method: RPBEPBE
basis: SDD
operation: Freq
keyword: #pfreq=noraman
keyword: PBEPBE/SDD
title: #p freq=noraman PBEPBE/SDD
converged: YES YES NO NO
title: Mulliken charges:
elementType: O O O O O O O C C C C C C C C C C C C C C H H H H H H H H H H H H H H
charge: -0.233570 -0.233640 -0.235193 -0.280365 -0.288974 -0.169895 -0.245403 -0.117728 -0.147186 -0.093546 -0.052716 -0.353958 0.243391 -0.500699 0.207163 0.222510 -0.336863 -0.335396 -0.216872 -0.215505 -0.218443 0.282421 0.291421 0.306752 0.263866 0.260425 0.259339 0.218964 0.237689 0.238468 0.271252 0.265614 0.237031 0.233928 0.235714
chargesum: 0.00000
title: Mulliken charges with hydrogens summed into heavy atoms:
elementType: O O O O O O O C C C C C C C C C C C C C C
charge: -0.233570 -0.233640 -0.235193 -0.280365 -0.288974 -0.169895 -0.245403 0.164694 0.144236 0.213206 0.211151 0.165806 0.243391 0.194422 0.207163 0.222510 -0.065611 -0.069782 0.020160 0.018423 0.017271
polarizability: 2.20272651e+02 -2.15910297e+01 1.44364313e+02 -1.38022790e+00 1.97558861e+00 1.45225999e+02
1716.lowfreq: -9.5763 -4.5953 -0.0009 -0.0005 -0.0004 5.0211 15.9926 24.0774 32.3091
frequency: 15.7860 24.0725 32.1567 50.9147 60.4990 75.3138 93.5233 120.0625 135.4418 156.2455 162.2528 197.8982 213.6065 240.1267 302.0783 321.3591 329.4005 332.9137 403.0491 419.0205 422.5436 444.6731 488.8537 502.5310 538.1963 613.6421 647.8204 660.1994 661.3124 674.2347 680.1227 700.5586 735.2303 759.6991 793.1937 796.1333 804.2376 839.3887 863.7368 874.4198 892.9282 914.5842 926.3309 954.2833 955.0117 981.8363 989.9732 991.6709 995.6449 1009.3869 1010.1433 1018.8319 1035.0716 1044.2071 1058.1463 1079.1922 1086.8757 1093.1954 1116.3194 1150.2295 1175.4752 1182.7072 1208.9044 1225.0735 1242.9349 1251.5433 1271.9881 1282.4461 1296.3407 1314.7087 1315.8082 1329.5526 1340.4435 1360.6375 1390.8933 1432.1781 1438.7152 1458.5616 1459.5609 1477.6511 1478.6543 1585.3130 1611.3561 1628.9605 1757.2133 2968.1444 3040.8629 3045.8633 3064.8990 3085.0063 3097.8557 3116.0391 3128.1700 3129.8106 3133.2343 3145.3182 3157.2347 3168.9909 3179.4904
redmass: 4.9871 6.8507 5.6354 5.8898 4.9117 5.5059 8.3303 2.5901 4.0144 4.2402 1.6067 5.2559 5.0656 6.0710 5.5087 7.1142 3.4082 5.8670 2.8175 4.5909 7.0437 4.2372 6.1821 7.0684 5.4970 6.4400 4.5676 10.6550 7.0780 9.9979 5.2311 1.5935 6.9463 5.9254 8.0205 2.2118 6.4720 3.2668 1.2455 4.4677 3.3789 4.0049 7.1874 3.8958 1.5265 6.2482 6.4311 6.6322 1.3928 3.2488 1.3679 3.2598 5.8610 3.0497 2.6667 2.0508 1.6832 2.4598 1.2743 1.3875 1.0564 1.1294 1.5065 1.5196 3.5331 1.2580 1.4661 1.1796 1.1780 1.3380 1.3192 1.4016 1.4488 1.3086 10.0156 1.1424 2.2473 1.0603 1.0920 1.5153 1.3586 6.5207 6.0795 10.1498 13.0405 1.0334 1.0872 1.0582 1.1016 1.0880 1.0884 1.0895 1.1018 1.1082 1.0857 1.0891 1.0938 1.0977 1.0984
irintensity: 0.6655 1.2049 0.3942 2.6570 0.1485 3.2973 2.2749 5.5620 0.3843 0.9570 0.4571 1.9741 4.0170 13.2517 1.4107 4.4200 17.4659 7.9219 0.0411 9.2796 1.3531 0.9409 13.0057 2.1509 18.3987 0.8299 0.8763 7.8885 12.4724 7.5875 13.0342 96.6346 7.3830 20.9945 2.5294 21.0010 30.6872 16.6349 0.0929 46.9278 34.9314 13.9612 32.9150 185.4880 23.9714 149.7945 91.3021 165.6036 0.9325 11.2978 0.3343 119.8914 277.8199 129.4446 75.0765 7.7582 12.3894 14.7318 0.1972 5.9063 0.0664 45.3671 8.5739 48.7344 257.9500 2.1009 2.9164 5.2993 12.0684 3.8573 2.6973 16.2557 3.9595 14.1427 3.1480 7.6885 17.9089 18.3930 14.3618 5.8762 13.1113 26.7532 15.8781 169.1629 602.4291 61.2550 29.6980 14.3176 36.4934 3.6197 4.4340 7.2197 17.3842 2.6671 0.2064 9.3203 13.5482 20.0529 8.8829
temp: 298.150 k
press: 1.00000 atm
elementType: 8 8 8 8 8 8 8 6 6 6 6 6 6 6 6 6 6 6 6 6 6 1 1 1 1 1 1 1 1 1 1 1 1 1 1
symmnumber: 1
zpe: 690657.1 jmol-1
zpe.correction: 0.263057 hartree
zpe.thermalcorrener: 0.281818 hartree
zpe.thermalcorrenthalpy: 0.282762 hartree
zpe.thermalcorrgfe: 0.212552 hartree
zpe.sumelectzpe: -1066.886394 hartree
zpe.sumelectthermal: -1066.867634 hartree
zpe.sumelectthermalent: -1066.866689 hartree
zpe.sumelectthermalfe: -1066.936900 hartree
dipole: -2.5849 -4.5927 3.7127
dipole: 6.4466
quadrupole: -105.8147 -133.3305 -121.7527
quadrupole: -26.5505 0.9046 4.0039
quadrupole: 14.4846 -13.0312 -1.4534 -26.5505 0.9046 4.0039
hfenergy: -1067.1494515 hartree
pointgroup: C01 [X(C14H14O7)]
dipole: -0.9992318 -0.2272137 2.3200684 debye
polarizability: 211.5643664|-30.267279|156.2194648|10.2948827|-0.699992|142.0791321 unknown
InChI: InChI=1S/C14H14O7/c1-17-13-11-10(20-14(16)21-11)9(19-13)7-18-12(15)8-5-3-2-4-6-8/h2-6,9-11,13H,7H2,1H3
charge 0 multiplicity 1
35 atoms
O  1.977177 -1.906334 -0.698265
O  1.646137 1.029587 -1.943364
O  3.804396 0.677301 -1.194076
O  2.951963 -1.570113 1.506431
O  -1.233633 -0.325411 0.543392
O  3.454808 1.533201 -3.349874
O  -2.346034 -1.765006 -0.918907
C  1.481036 0.446893 -0.588337
C  2.945005 0.208349 -0.088176
C  0.835499 -0.951493 -0.667524
C  3.072301 -1.31812 0.08422
C  -0.082385 -1.263479 0.533373
C  3.012374 1.119072 -2.283756
C  3.150722 -2.987957 1.860635
C  -2.34166 -0.706957 -0.244727
C  -3.455518 0.275299 -0.161313
C  -4.619243 0.021482 -0.934658
C  -3.385239 1.434093 0.655972
C  -5.703307 0.920627 -0.891431
C  -4.473592 2.330316 0.695423
C  -5.632308 2.076354 -0.076894
H  0.893325 1.160741 0.006395
H  3.226328 0.75004 0.824821
H  0.287169 -1.086701 -1.61338
H  4.005516 -1.738648 -0.333664
H  0.431367 -1.100488 1.492988
H  -0.445099 -2.301633 0.451216
H  4.169887 -3.318268 1.57821
H  2.402328 -3.628084 1.3594
H  3.030405 -3.04301 2.952592
H  -4.650795 -0.878398 -1.55768
H  -2.486366 1.617658 1.250781
H  -6.599712 0.724952 -1.489212
H  -4.421148 3.224525 1.325596
H  -6.475404 2.775407 -0.044104
