program: Gaussian 09
title: 000286601
version: EM64L-G09RevD.01
frameworkgroup: C1[X(C18H19NO7S)]
method: RPBEPBE
basis: SDD
operation: Freq
keyword: #p
keyword: freq=noraman
keyword: PBEPBE/SDD
title: #p freq=noraman PBEPBE/SDD
converged: YES YES NO NO
title: Mulliken charges:
elementType: S O O O O O O O N C C C C C C C C C C C C C C C C C C H H H H H H H H H H H H H H H H H H H
charge: 0.978881 -0.404053 -0.284714 -0.257219 -0.488466 -0.520046 -0.262487 -0.303843 -0.366394 -0.175656 -0.346764 -0.003173 0.291401 0.309029 -0.273046 -0.250285 -0.477442 0.472528 -0.200624 -0.216797 -0.209902 -0.389889 -0.367529 -0.225611 -0.228196 -0.233264 -0.510974 0.290714 0.262185 0.265115 0.353509 0.295164 0.339336 0.220134 0.244621 0.246887 0.249862 0.241197 0.231999 0.272644 0.226469 0.227658 0.228933 0.234254 0.242784 0.271068
chargesum: 0.00000
title: Mulliken charges with hydrogens summed into heavy atoms:
elementType: S O O O O O O O N C C C C C C C C C C C C C C C C C C
charge: 0.978881 -0.404053 -0.284714 -0.257219 -0.488466 -0.520046 -0.262487 -0.303843 -0.012885 0.115058 0.180537 -0.003173 0.291401 0.309029 0.022119 0.089051 -0.012687 0.472528 0.046263 0.033065 0.031294 -0.157890 -0.094885 0.000858 -0.000538 -0.004331 0.237132
polarizability: 2.62631944e+02 -1.37098262e+01 2.69587725e+02 1.26472966e+01 -1.55240443e+01 2.12465191e+02
1716.lowfreq: -4.8832 -0.0011 -0.0004 0.0021 2.7372 3.6268 12.7913 14.2882 16.9114
frequency: 12.5969 14.2770 16.7177 35.3169 40.5040 48.3811 54.8896 68.7634 73.2122 85.0467 95.9342 108.7614 120.1576 142.1593 146.3961 156.0171 156.9789 175.8494 207.6434 215.7760 237.8585 247.8873 256.2592 287.2370 302.2437 325.8195 332.5239 340.2808 375.2140 391.0488 404.5282 405.7073 433.6421 469.1531 473.9996 498.3782 521.9645 556.2366 599.8083 602.9125 617.6066 618.7449 636.0160 656.6060 661.3703 687.1718 702.9947 707.0379 746.8532 757.4369 763.6822 801.3087 815.7259 832.9414 856.6365 858.9034 868.7018 875.0728 930.2974 935.3655 946.4372 959.8897 963.4252 972.6075 979.8292 982.5450 989.4703 992.6808 998.7885 1000.6492 1006.2842 1009.8719 1027.3261 1034.2073 1044.8735 1086.2259 1091.0498 1117.0307 1149.3712 1157.1665 1164.3634 1173.0916 1174.8145 1189.2490 1192.4764 1208.6990 1222.0529 1232.9932 1240.8480 1255.5109 1319.6250 1330.7147 1332.9278 1350.2952 1354.3254 1383.0118 1385.7371 1418.5816 1426.5415 1438.4836 1442.3081 1452.1274 1457.3556 1462.4129 1467.7009 1478.8013 1485.1916 1571.9639 1594.5872 1600.4458 1614.9547 1643.8073 1650.6927 3007.4087 3008.6632 3034.9843 3048.9496 3083.0975 3108.8900 3117.8688 3118.9838 3126.9727 3132.1889 3139.0640 3142.3753 3149.8666 3154.9682 3155.9955 3163.9906 3166.8205 3176.7924 3555.3235
redmass: 5.8112 6.2042 4.6654 4.7232 4.6422 5.6458 5.0007 5.3452 7.1397 9.2073 9.7075 2.6314 1.5399 5.1580 6.7805 5.9205 7.9706 4.8348 5.6736 5.3070 6.4949 8.1612 4.8541 6.2254 4.3512 8.4081 3.8252 3.4404 6.5324 3.0188 2.8192 2.8828 5.7141 4.2114 7.5969 4.7309 6.2480 4.4986 6.3824 4.1003 5.4501 1.5431 4.7415 6.9805 3.3980 2.6322 2.4828 4.1799 6.0290 2.1178 1.3506 4.3150 3.4844 15.4435 1.2361 1.2568 5.4846 5.0631 4.6985 1.5848 1.3404 15.5956 2.5346 6.1532 2.2995 1.4884 4.9629 1.3884 4.0525 1.3622 4.8286 1.3362 2.2209 2.7401 2.0544 1.6150 1.5198 1.3007 2.7636 1.8102 2.5877 1.0544 1.0622 1.1215 1.1320 1.7452 2.8531 1.4350 1.1592 1.4338 1.2738 1.2572 1.4326 1.2535 1.2785 8.1244 7.9190 1.1688 1.1014 2.2530 2.1800 1.0506 1.9077 1.1426 1.0519 1.9831 2.2618 5.5796 6.0929 6.7833 6.0625 9.3445 9.4009 1.0571 1.0288 1.0587 1.0834 1.1077 1.1072 1.1054 1.0864 1.0873 1.0929 1.0921 1.0877 1.0964 1.1052 1.0911 1.1016 1.0960 1.1012 1.0774
irintensity: 0.1029 0.3680 0.1977 0.3730 0.6893 1.1781 0.5284 1.2970 4.7353 7.1794 3.1003 0.4193 0.7651 1.0359 0.8647 1.5976 2.0857 17.3729 2.5334 3.6903 8.4786 10.1779 1.7108 6.3724 14.9117 6.7347 6.1594 21.0495 12.4957 12.7616 0.1124 0.3800 12.3307 28.2591 52.1896 44.4687 105.2978 26.1765 2.9489 12.5162 2.6103 51.4417 21.7738 7.7919 30.3135 29.3229 30.1361 59.1464 5.5580 65.4631 74.0225 9.4834 10.2358 82.9566 1.9151 0.6094 103.2795 27.8328 22.8098 4.2696 4.6369 94.5472 44.4676 1.1220 14.6496 7.8215 15.9088 0.9437 176.9995 10.3564 2.4965 0.2059 6.2571 105.7112 15.4956 1.9498 9.9817 3.7222 83.8841 24.7980 256.2528 0.2745 0.8521 1.7871 6.6406 48.2249 27.4854 28.6014 7.1051 130.1755 1.9300 6.5414 57.3750 22.4484 13.0925 9.0488 0.7605 20.9266 24.1181 21.4733 9.5627 7.9712 21.0056 10.2868 7.4219 504.0784 59.4380 0.7498 2.4252 1.7752 0.5347 266.7122 191.8532 13.2504 28.2740 33.0322 8.1699 2.7279 5.5760 16.0727 5.5161 1.7465 62.9598 18.9619 5.9773 25.3087 14.6667 3.9149 24.8661 2.0565 27.3884 69.2393
temp: 298.150 k
press: 1.00000 atm
elementType: 16 8 8 8 8 8 8 8 7 6 6 6 6 6 6 6 6 6 6 6 6 6 6 6 6 6 6 1 1 1 1 1 1 1 1 1 1 1 1 1 1 1 1 1 1 1
symmnumber: 1
zpe: 904306.1 jmol-1
zpe.correction: 0.344432 hartree
zpe.thermalcorrener: 0.371452 hartree
zpe.thermalcorrenthalpy: 0.372396 hartree
zpe.thermalcorrgfe: 0.282159 hartree
zpe.sumelectzpe: -1674.544296 hartree
zpe.sumelectthermal: -1674.517276 hartree
zpe.sumelectthermalent: -1674.516332 hartree
zpe.sumelectthermalfe: -1674.606569 hartree
dipole: -0.5822 3.3221 -1.8887
dipole: 3.8655
quadrupole: -159.2147 -141.8397 -163.8640
quadrupole: -6.2016 17.7914 -5.7821
quadrupole: -4.2419 13.1331 -8.8912 -6.2016 17.7914 -5.7821
hfenergy: -1674.8887283 hartree
pointgroup: C01 [X(C18H19N1O7S1)]
dipole: 0.1768505 -0.9737606 -1.1547384 debye
polarizability: 261.2083185|-7.4741399|252.961733|-17.4918191|30.7587522|230.5148081 unknown
InChI: InChI=1S/C18H19NO7S/c1-24-17(20)16(13-26-27(22,23)15-10-6-3-7-11-15)19-18(21)25-12-14-8-4-2-5-9-14/h2-11,16,19H,12-13H2,1H3
charge 0 multiplicity 1
46 atoms
S  3.724206 -0.321412 1.105541
O  1.852467 -0.486683 1.383583
O  -2.286297 -0.200011 -0.972212
O  1.708077 3.372618 0.607908
O  4.496636 -1.102445 2.288771
O  4.016143 1.25883 0.87282
O  1.560406 1.886441 -1.18167
O  -2.279701 1.985445 -0.067349
N  -0.506393 0.487426 0.25836
C  0.348062 1.43875 0.950774
C  1.216616 0.698599 1.998437
C  3.83421 -1.322453 -0.483654
C  1.249164 2.230561 -0.019545
C  -1.733013 0.862613 -0.241233
C  4.463828 -2.57428 -0.388965
C  3.310021 -0.771248 -1.66481
C  -3.663265 0.045507 -1.522197
C  -4.741551 -0.405062 -0.560517
C  4.58155 -3.327028 -1.579854
C  3.442054 -1.548635 -2.839623
C  4.072681 -2.815059 -2.796698
C  -5.300214 -1.703976 -0.664657
C  -5.209627 0.470098 0.454602
C  -6.307952 -2.127098 0.230711
C  -6.215926 0.047761 1.350861
C  -6.768086 -1.250567 1.240862
C  2.767292 4.131236 -0.106684
H  -0.285175 2.172884 1.480688
H  1.970809 1.38963 2.419207
H  0.578532 0.295914 2.804368
H  -0.114743 -0.421536 0.003497
H  4.847482 -2.937284 0.569645
H  2.81306 0.205442 -1.68001
H  -3.666826 -0.548897 -2.449465
H  -3.745028 1.122041 -1.751311
H  5.067539 -4.307425 -1.552104
H  3.045304 -1.160285 -3.782954
H  4.167416 -3.405452 -3.71431
H  -4.942864 -2.384828 -1.44724
H  -4.770563 1.47076 0.53855
H  -6.734453 -3.132439 0.140476
H  -6.572222 0.729669 2.131137
H  -7.551462 -1.575666 1.934975
H  2.924583 5.032918 0.500527
H  2.431242 4.385729 -1.125193
H  3.676684 3.509395 -0.147446
