program: Gaussian 09
title: 000286554
version: EM64L-G09RevD.01
frameworkgroup: C1[X(C10H9ClN2O4S)]
method: RPBEPBE
basis: SDD
operation: Freq
keyword: #p
keyword: freq=noraman
keyword: PBEPBE/SDD
title: #p freq=noraman PBEPBE/SDD
converged: YES YES NO NO
title: Mulliken charges:
elementType: Cl S O O O O N N C C C C C C C C C C H H H H H H H H H
charge: 0.011004 0.997794 -0.201489 -0.565505 -0.497757 -0.496478 -0.333089 -0.022235 -0.641151 0.647374 0.241424 0.184028 -0.068201 -0.297337 -0.311024 -0.219867 -0.238338 -0.752025 0.283830 0.278353 0.286750 0.306321 0.287592 0.235936 0.261388 0.237913 0.384789
chargesum: 0.00000
title: Mulliken charges with hydrogens summed into heavy atoms:
elementType: Cl S O O O O N N C C C C C C C C C C
charge: 0.011004 0.997794 -0.201489 -0.180716 -0.497757 -0.496478 -0.333089 -0.022235 -0.078967 0.647374 0.241424 0.184028 -0.068201 -0.297337 -0.024274 0.086454 0.049253 -0.016788
polarizability: 2.75046585e+02 5.53926427e+00 1.66434132e+02 -2.82646663e-01 -8.01894627e-01 1.03908478e+02
1716.lowfreq: -5.7379 0.0008 0.0018 0.0027 3.8862 5.0463 23.1984 34.8348 47.7245
frequency: 23.1910 34.8337 47.7179 70.3480 104.4902 116.7636 136.1540 151.3042 160.2001 170.5568 176.3310 206.2987 211.3566 252.0624 281.8621 297.9637 316.7563 333.2057 350.0162 385.5866 414.9713 438.2765 443.4848 460.6360 480.9646 534.8949 548.3482 571.5580 585.8602 597.7366 649.7942 711.9178 735.5064 768.4594 828.3198 835.8353 887.7127 893.0234 893.5651 937.6392 963.7194 969.5014 991.3191 1026.5319 1034.0798 1039.7138 1048.8714 1072.4920 1124.5266 1143.8188 1156.1005 1193.5293 1256.2010 1308.5969 1358.8866 1374.7587 1386.5895 1403.2568 1405.8130 1452.6287 1459.3009 1475.2448 1573.2779 1579.3948 1585.7799 1656.5283 2980.6397 3017.3628 3055.5224 3071.0318 3112.2904 3168.6914 3169.9920 3193.8924 3479.6524
redmass: 8.9457 6.7288 6.5000 5.6065 6.3925 8.6803 2.9790 1.1683 2.4969 3.0749 4.5018 5.4778 6.9250 4.0926 4.0525 5.3144 7.8465 6.5425 6.8189 6.5836 10.4561 2.6784 3.1831 4.8539 7.0670 7.5574 6.1210 6.4484 4.9985 4.5886 7.2302 5.4633 5.4566 6.3405 1.4715 10.9149 3.3053 1.5011 1.8114 6.0456 1.5621 7.6438 2.1116 3.2652 1.9308 4.2608 1.2198 2.2388 1.2760 2.6902 1.6630 1.5366 1.3454 3.7553 3.5276 4.2743 4.2674 1.1320 1.4651 1.1347 1.0466 3.1554 6.1392 7.4518 6.5169 12.6136 1.0380 1.0620 1.0971 1.0993 1.0984 1.0929 1.0909 1.0961 1.0661
irintensity: 1.2459 1.2205 1.8608 1.7243 0.8101 3.9564 5.3759 1.3566 15.2996 27.2833 11.8843 11.1360 4.0798 30.3985 26.2303 13.6152 11.5005 14.4887 35.5819 3.2712 65.4128 2.0495 4.2346 3.8864 3.5709 105.7493 34.2275 17.3063 17.4434 62.2419 17.4673 16.1183 18.6065 18.9249 41.5843 74.5144 16.9894 15.5144 1.3759 7.1825 5.9681 73.4684 10.2210 35.3340 4.8253 49.5990 67.2070 75.4521 0.6100 28.6186 49.0677 19.6328 3.0410 170.7352 32.3474 17.7295 56.8147 29.7682 28.4383 13.7076 18.1788 178.2780 19.1212 8.0086 71.5449 224.2339 23.0086 0.1987 12.1043 0.6561 6.9173 9.6736 4.2369 1.8834 47.5643
temp: 298.150 k
press: 1.00000 atm
elementType: 17 16 8 8 8 8 7 7 6 6 6 6 6 6 6 6 6 6 1 1 1 1 1 1 1 1 1
symmnumber: 1
zpe: 468547.6 jmol-1
zpe.correction: 0.178460 hartree
zpe.thermalcorrener: 0.196627 hartree
zpe.thermalcorrenthalpy: 0.197571 hartree
zpe.thermalcorrgfe: 0.130756 hartree
zpe.sumelectzpe: -1653.470162 hartree
zpe.sumelectthermal: -1653.451995 hartree
zpe.sumelectthermalent: -1653.451051 hartree
zpe.sumelectthermalfe: -1653.517866 hartree
dipole: 6.8759 0.3843 2.7452
dipole: 7.4136
quadrupole: -98.3136 -126.6117 -121.7504
quadrupole: -0.7744 -6.3137 -5.2969
quadrupole: 17.2449 -11.0531 -6.1918 -0.7744 -6.3137 -5.2969
hfenergy: -1653.648622 hartree
pointgroup: C01 [X(C10H9Cl1N2O4S1)]
dipole: 2.7339431 -0.3057294 -0.9692612 debye
polarizability: 274.8760852|-4.8998812|164.7575386|5.8531684|-10.1990781|105.755571 unknown
InChI: InChI=1S/C10H9ClN2O4S/c1-6-4-10(14)13(12-6)9-3-2-7(5-8(9)11)18(15,16)17/h2-3,5,15H,4H2,1H3
charge 0 multiplicity 1
27 atoms
Cl 0.726457 -2.422644 1.241982
S  -4.125858 -0.096721 -0.059764
O  2.258363 2.498961 0.807897
O  -4.232803 -0.729457 -1.803678
O  -4.640905 -1.256907 0.942906
O  -4.766439 1.38774 -0.011204
N  1.937856 0.251361 0.054021
N  2.749432 -0.851878 -0.402185
C  4.160067 0.943912 0.229635
C  0.524325 0.140975 0.050566
C  4.011134 -0.464931 -0.305035
C  2.705092 1.393371 0.418737
C  -2.260829 0.006056 -0.019242
C  -0.154718 -1.026175 0.502997
C  -0.243039 1.252618 -0.392402
C  -1.558508 -1.11285 0.449351
C  -1.647709 1.199091 -0.429913
C  5.132032 -1.369778 -0.716162
H  4.69844 0.984886 1.194434
H  4.6933 1.618162 -0.464431
H  0.278744 2.159217 -0.706005
H  -2.084922 -2.006105 0.798345
H  -2.243485 2.052888 -0.764356
H  5.737826 -0.912638 -1.521282
H  4.733033 -2.331623 -1.075525
H  5.815232 -1.564704 0.132115
H  -5.202819 -0.850227 -2.022406
