program: Gaussian 09
title: 000286542
version: EM64L-G09RevD.01
frameworkgroup: C1[X(C9H16ClN3O)]
method: RPBEPBE
basis: SDD
operation: Freq
keyword: #p
keyword: freq=noraman
keyword: PBEPBE/SDD
title: #p freq=noraman PBEPBE/SDD
converged: NO YES NO NO
title: Mulliken charges:
elementType: Cl O N N N C C C C C C C C C H H H H H H H H H H H H H H H H
charge: -0.212132 -0.296533 -0.241231 -0.602536 -0.011684 -0.158730 -0.142970 -0.055220 -0.073178 -0.434877 -0.350312 -0.739331 -0.197130 -0.489928 0.269363 0.267745 0.231216 0.300589 0.301034 0.306871 0.235561 0.200328 0.265116 0.216467 0.206855 0.290025 0.263578 0.201638 0.233170 0.216238
chargesum: 0.00000
title: Mulliken charges with hydrogens summed into heavy atoms:
elementType: Cl O N N N C C C C C C C C C
charge: -0.212132 -0.296533 0.065640 -0.048933 -0.011684 0.110633 0.124776 0.175996 0.227410 -0.133843 0.085577 -0.050893 -0.197130 0.161118
polarizability: 1.30765029e+02 -3.05843576e+00 1.45786156e+02 2.65864330e+00 6.30228282e+00 1.04955758e+02
1716.lowfreq: -10.6283 -4.3640 0.0014 0.0014 0.0018 9.8245 45.2411 50.6301 68.2708
frequency: 45.1626 50.5096 68.1438 87.4976 104.9562 119.8150 135.2472 162.4444 209.8034 221.7433 252.8120 270.0931 283.2261 289.7859 305.9889 328.8679 371.6278 378.2516 400.5381 441.3047 446.5373 509.6000 518.7441 565.9420 597.0144 607.2760 649.9972 746.6045 822.7659 826.4315 872.4487 927.4002 971.1763 996.6562 1018.0530 1030.6935 1052.7149 1065.0767 1100.4257 1106.1796 1111.5649 1124.4860 1129.8990 1151.1061 1158.7594 1169.1714 1218.8459 1224.8804 1246.6974 1274.0032 1286.6198 1298.9972 1323.1813 1331.3773 1342.1003 1368.9633 1376.8375 1385.3344 1410.7693 1439.3567 1458.4532 1467.2506 1467.4292 1472.2771 1484.6387 1489.2325 1632.3150 2197.9222 2917.7312 2930.4689 2938.6953 2971.9152 2981.0170 2987.4223 2995.9204 3010.2578 3034.4100 3070.5764 3105.8830 3112.4737 3131.0346 3475.5885 3507.0531 3613.2716
redmass: 3.6466 5.4246 4.8387 2.5841 4.6505 11.6356 4.7305 6.2440 1.3009 1.0433 1.2913 2.9736 3.3765 4.1447 3.4765 2.7498 3.1006 4.4281 2.8047 3.1879 4.4735 2.4395 1.9839 4.2515 3.2817 4.3742 1.6657 3.5185 2.5067 3.0823 2.4058 2.1273 2.5062 2.8245 1.5528 2.0750 4.2825 1.7729 2.1002 1.9703 1.5373 1.6174 1.8823 1.7680 1.8698 1.6016 1.5206 1.1761 1.3833 1.6004 1.3782 1.2866 1.3911 1.5340 1.4602 1.2908 1.3365 1.2605 2.3124 1.1470 1.0507 1.0912 1.1254 1.1326 1.0707 1.1575 1.0978 12.5847 1.0824 1.0402 1.0500 1.0792 1.0378 1.1050 1.0836 1.1029 1.0860 1.0992 1.0981 1.0977 1.0912 1.0455 1.0764 1.0980
irintensity: 0.8756 2.2904 0.4420 8.7535 6.1574 2.1343 8.2205 1.1082 4.2832 1.1632 17.5375 2.8159 2.6830 53.2688 0.0589 2.4146 2.1644 30.4273 32.4879 16.6302 64.7385 35.6336 164.9975 30.1036 59.9706 6.6752 164.5075 6.2355 8.2107 12.2010 2.8069 0.5625 27.0006 7.8913 7.5242 14.4521 106.5754 28.5934 17.7214 23.5178 31.2448 14.0468 2.8337 13.9168 1.3997 7.1088 5.3349 3.7195 14.9815 43.7237 7.3816 18.2876 1.5160 11.6215 16.4451 7.0121 0.1974 40.1109 38.6918 0.2668 12.9650 14.5978 32.0389 3.9631 12.8187 24.3603 38.0228 12.2729 23.2325 49.7378 87.4242 0.3261 36.5432 46.2024 8.6870 52.8685 13.9473 35.5453 26.1969 9.9713 6.0050 3.2850 16.4764 4.9344
temp: 298.150 k
press: 1.00000 atm
elementType: 17 8 7 7 7 6 6 6 6 6 6 6 6 6 1 1 1 1 1 1 1 1 1 1 1 1 1 1 1 1
symmnumber: 1
zpe: 650683.2 jmol-1
zpe.correction: 0.247832 hartree
zpe.thermalcorrener: 0.263788 hartree
zpe.thermalcorrenthalpy: 0.264732 hartree
zpe.thermalcorrgfe: 0.204445 hartree
zpe.sumelectzpe: -1050.956758 hartree
zpe.sumelectthermal: -1050.940802 hartree
zpe.sumelectthermalent: -1050.939858 hartree
zpe.sumelectthermalfe: -1051.000145 hartree
dipole: -1.8970 -5.5582 -0.8348
dipole: 5.9321
quadrupole: -81.7002 -112.6432 -85.9283
quadrupole: -0.6760 -8.8272 -5.0831
quadrupole: 11.7237 -19.2193 7.4956 -0.6760 -8.8272 -5.0831
hfenergy: -1051.2045902 hartree
pointgroup: C01 [X(C9H16Cl1N3O1)]
dipole: -0.3687176 2.2579848 -0.460901 debye
polarizability: 136.5266624|-8.2092506|139.036746|-0.1433235|-8.7030475|105.9435337 unknown
InChI: InChI=1S/C9H16ClN3O/c1-5-8(12)7(4-14-2)6(3-11)9(10)13-5/h5-9,13H,4,12H2,1-2H3
charge 0 multiplicity 1
30 atoms
Cl -1.400529 -2.616446 1.100565
O  2.0531 1.487944 -0.562622
N  -2.006949 -0.588659 -0.864821
N  -0.879145 2.355496 1.204173
N  2.275313 -2.731547 0.058676
C  0.352664 0.217542 0.607757
C  -0.746832 1.269737 0.222318
C  -2.132695 0.589426 0.034432
C  0.373733 -0.934073 -0.448115
C  -1.026728 -1.545589 -0.636433
C  1.735881 0.870109 0.733142
C  -3.175944 1.555657 -0.546168
C  1.39638 -1.95404 -0.155669
C  3.420774 2.002029 -0.616207
H  0.088922 -0.230798 1.587647
H  -0.452223 1.725779 -0.740986
H  -2.472469 0.234279 1.035365
H  0.651341 -0.472812 -1.4205
H  -1.057434 -2.382008 -1.345841
H  -2.901589 -0.943821 -1.214826
H  2.503746 0.109995 0.992373
H  1.726516 1.643386 1.531798
H  -3.225133 2.454998 0.087612
H  -2.894432 1.861231 -1.570714
H  -4.180614 1.092333 -0.581689
H  -0.212112 3.12179 1.100416
H  -1.006884 2.055616 2.175151
H  3.588293 2.79248 0.146122
H  3.553067 2.430577 -1.622039
H  4.161483 1.19049 -0.459215
