program: Gaussian 09
title: 000286530
version: EM64L-G09RevD.01
frameworkgroup: C1[X(C14H18N2)]
method: RPBEPBE
basis: SDD
operation: Freq
keyword: #pfreq=noraman
keyword: PBEPBE/SDD
title: #p freq=noraman PBEPBE/SDD
converged: NO YES NO NO
title: Mulliken charges:
elementType: N N C C C C C C C C C C C C C C H H H H H H H H H H H H H H H H H H
charge: -0.062472 -0.487406 -0.365585 -0.352674 -0.396998 -0.392049 -0.400806 -0.487663 0.399786 -0.545403 0.201205 0.297557 -0.369661 -0.433146 -0.222948 -0.251984 0.239970 0.167652 0.164659 0.211006 0.209176 0.193368 0.191102 0.206569 0.188587 0.214890 0.234453 0.175802 0.296024 0.276967 0.227023 0.236494 0.218668 0.217838
chargesum: 0.00000
title: Mulliken charges with hydrogens summed into heavy atoms:
elementType: N N C C C C C C C C C C C C C C
charge: -0.062472 -0.191382 0.042037 0.022991 0.005546 0.005621 0.002671 -0.077408 0.399786 -0.268435 0.201205 0.297557 -0.142639 -0.196652 -0.004280 -0.034146
polarizability: 2.34289195e+02 1.52119089e+01 1.45349575e+02 1.40851231e+01 -1.52838691e+01 1.14042466e+02
1716.lowfreq: -0.0007 -0.0003 -0.0002 3.6849 6.9837 13.9480 24.8927 48.1549 56.5004
frequency: 24.0820 48.0635 56.3531 136.0901 144.2467 226.2162 244.4967 246.8542 282.4361 297.1499 310.6654 382.5795 414.8417 432.7431 445.1900 461.7770 515.0576 536.5215 569.6916 576.3706 603.0986 630.0472 700.9827 745.4587 754.7178 760.3514 806.4786 808.4820 824.5277 852.2868 854.8632 856.1334 879.3087 905.7365 929.4561 959.8010 968.5905 975.7264 983.8977 1000.3446 1012.3386 1048.1496 1081.4927 1108.8941 1112.6450 1122.9074 1135.2334 1153.4610 1158.5909 1164.0983 1190.3735 1215.5908 1229.7535 1253.2713 1264.4861 1270.9393 1290.0670 1296.7968 1320.7751 1331.6178 1340.7093 1344.2585 1349.4316 1365.9309 1377.1972 1410.6336 1421.1057 1451.9044 1457.1135 1459.9142 1463.6142 1466.2054 1470.2146 1479.6800 1482.4628 1560.5163 1593.1946 1630.8207 2786.1521 2811.2302 2826.2612 2966.0613 2980.0052 2985.1392 2987.7105 3018.0923 3033.5647 3041.8303 3046.4164 3055.4728 3121.2759 3129.6415 3143.8251 3161.2347 3225.7249 3598.6096
redmass: 3.9288 4.3691 3.0709 3.3789 4.1892 2.5561 2.8458 3.0762 2.8619 2.6141 2.9918 1.7296 3.5376 2.9272 2.9166 2.8002 1.2411 3.3041 2.3718 3.4645 6.6051 3.2443 4.6019 1.2541 3.4037 3.8343 1.4734 3.0145 1.3623 1.9463 1.9057 1.5010 4.7527 2.3420 1.3871 1.2873 1.3016 3.6351 1.9932 2.5418 2.2249 2.1022 1.3729 2.2477 1.6652 2.5514 1.4567 1.2922 2.2020 1.1358 1.3057 1.6646 1.8894 1.3805 1.2665 1.3999 1.6964 1.9579 1.7701 1.3210 1.4031 1.5253 1.4956 1.5261 1.8619 2.3414 2.4617 1.0920 1.1480 1.0880 3.7259 1.1212 1.0903 1.1129 2.9606 6.2572 5.6671 7.1773 1.0714 1.0714 1.0694 1.0628 1.0838 1.0620 1.0612 1.0870 1.0954 1.0881 1.1032 1.1036 1.0848 1.0889 1.0952 1.1002 1.0978 1.0801
irintensity: 0.2546 0.0990 0.1066 3.2914 0.9886 0.2238 0.6011 0.2905 1.3266 4.5073 2.2578 2.9181 3.4282 5.3756 0.9641 2.8409 65.8220 2.1908 8.4271 0.1921 1.8880 20.8815 1.7578 74.4110 9.5568 8.2188 0.1293 5.1728 49.5988 2.3381 15.4451 6.4834 1.0207 2.3836 5.4983 3.6627 0.0872 5.3288 22.2829 11.5656 7.9099 11.1055 3.2254 32.7256 1.9234 5.5703 16.2450 4.7458 31.7917 5.9274 1.1756 4.5142 8.1887 13.7559 0.3606 11.8463 3.0822 14.9348 43.0145 2.7816 1.8505 53.0693 4.0089 27.2431 15.2572 1.9259 17.7067 8.0935 7.9654 13.4052 19.1021 11.4403 3.8161 6.8958 1.7237 5.9229 6.5160 0.2130 71.4851 44.3097 228.6606 41.5675 26.7538 29.1644 27.9729 65.5905 71.7974 22.5344 17.6489 92.0817 1.1675 4.8678 38.6719 35.7013 1.8118 39.6316
temp: 298.150 k
press: 1.00000 atm
elementType: 7 7 6 6 6 6 6 6 6 6 6 6 6 6 6 6 1 1 1 1 1 1 1 1 1 1 1 1 1 1 1 1 1 1
symmnumber: 1
zpe: 765348.9 jmol-1
zpe.correction: 0.291506 hartree
zpe.thermalcorrener: 0.305134 hartree
zpe.thermalcorrenthalpy: 0.306078 hartree
zpe.thermalcorrgfe: 0.250258 hartree
zpe.sumelectzpe: -652.608273 hartree
zpe.sumelectthermal: -652.594646 hartree
zpe.sumelectthermalent: -652.593701 hartree
zpe.sumelectthermalfe: -652.649521 hartree
dipole: -2.0382 -2.1472 1.1134
dipole: 3.1630
quadrupole: -93.5388 -87.8096 -97.3120
quadrupole: -0.6382 2.7528 -4.7528
quadrupole: -0.6520 5.0772 -4.4252 -0.6382 2.7528 -4.7528
hfenergy: -652.8997794 hartree
pointgroup: C01 [X(C14H18N2)]
dipole: 0.807763 -0.747617 -0.5806233 debye
polarizability: 234.8647733|-16.0187029|138.8925557|10.2755024|19.8956299|119.9239072 unknown
InChI: InChI=1S/C14H18N2/c1-4-8-16(9-5-1)11-13-10-12-6-2-3-7-14(12)15-13/h2-3,6-7,10,15H,1,4-5,8-9,11H2
charge 0 multiplicity 1
34 atoms
N  2.276483 -0.388649 0.188133
N  -1.225007 -1.345345 -0.616201
C  2.339822 0.464103 -1.025992
C  3.594873 -0.992631 0.504727
C  3.365919 1.60067 -0.847102
C  4.658306 0.099287 0.734719
C  4.760234 1.033047 -0.493793
C  1.203123 -1.403662 0.116175
C  -0.17721 -0.793236 0.146402
C  -0.67852 0.282472 0.879409
C  -2.406608 -0.631061 -0.381452
C  -2.086545 0.411141 0.563751
C  -3.70422 -0.80521 -0.909129
C  -3.117696 1.295887 0.978859
C  -4.706229 0.089082 -0.478112
C  -4.414997 1.127716 0.455889
H  1.333479 0.881538 -1.207635
H  2.619427 -0.148349 -1.92601
H  3.940893 -1.670119 -0.322607
H  3.484985 -1.61324 1.414509
H  3.018395 2.265968 -0.033332
H  3.412378 2.20225 -1.775184
H  5.634994 -0.377184 0.946408
H  4.371904 0.690458 1.625902
H  5.153203 0.459239 -1.359217
H  5.476539 1.853393 -0.298548
H  1.329639 -2.078172 0.98743
H  1.295148 -2.054123 -0.798369
H  -1.124963 -2.130958 -1.256072
H  -0.088038 0.900803 1.552189
H  -3.932742 -1.60222 -1.626076
H  -2.906814 2.09656 1.696643
H  -5.725685 -0.015518 -0.866225
H  -5.218966 1.803463 0.76891
