program: Gaussian 09
title: 000286564
version: EM64L-G09RevD.01
frameworkgroup: C1[X(C17H17ClN6O3)]
method: RPBEPBE
basis: SDD
operation: Freq
keyword: #p
keyword: freq=noraman
keyword: PBEPBE/SDD
title: #p freq=noraman PBEPBE/SDD
converged: YES YES NO NO
title: Mulliken charges:
elementType: Cl O O O N N N N N N C C C C C C C C C C C C C C C C C H H H H H H H H H H H H H H H H H
charge: -0.031350 -0.264059 -0.206922 -0.198222 -0.187908 -0.089458 -0.040575 -0.333468 -0.094840 0.018382 -0.001735 -0.414727 -0.411383 -0.377294 -0.307992 0.131934 -0.209969 -0.120880 0.213928 -0.580649 -0.370698 0.646698 -0.498879 -0.347528 0.391851 -0.175577 -0.372858 0.249352 0.217277 0.232590 0.228352 0.205240 0.206479 0.213716 0.189268 0.228908 0.283226 0.336274 0.261900 0.255510 0.246556 0.321038 0.264823 0.293671
chargesum: 0.00000
title: Mulliken charges with hydrogens summed into heavy atoms:
elementType: Cl O O O N N N N N N C C C C C C C C C C C C C C C C C
charge: -0.031350 -0.264059 -0.206922 -0.198222 -0.187908 -0.089458 -0.040575 0.002806 -0.094840 0.018382 0.247617 0.035140 0.022209 0.042900 0.110185 0.131934 0.073257 -0.120880 0.213928 -0.063239 -0.124142 0.646698 -0.177842 -0.347528 0.391851 0.089246 -0.079187
polarizability: 3.17614507e+02 5.15385195e+00 2.67973374e+02 6.46928625e+00 -1.56046192e+01 1.79424551e+02
1716.lowfreq: -9.4982 -4.0912 -0.1791 -0.0014 -0.0009 -0.0006 13.2988 13.9899 19.2756
frequency: 12.6930 13.3284 19.2235 27.7457 43.1957 53.5999 54.9227 87.3870 113.5552 117.6949 163.0279 174.8904 185.2132 202.3974 217.9152 229.1768 256.5172 271.5035 283.7638 298.8561 321.1849 330.5135 360.8153 377.4430 401.3323 442.9525 446.7999 455.9408 493.1125 499.2641 517.3993 523.3983 541.0468 561.2628 571.3488 601.2288 619.9797 642.8530 646.2672 665.9897 674.9904 705.5884 711.6131 731.1544 765.7644 773.1086 792.9662 801.1022 831.0563 832.4234 836.5942 849.3231 862.1559 882.9011 889.5281 926.8789 931.3686 939.5915 958.1926 974.8576 978.5765 995.4535 1014.8356 1021.6602 1043.6945 1078.7269 1089.8021 1090.4058 1113.6704 1120.5120 1133.5376 1148.0081 1164.8947 1190.1458 1195.7963 1206.4511 1214.4785 1245.9796 1249.9376 1252.7374 1276.4885 1283.0332 1304.9044 1308.7634 1315.6573 1332.0896 1338.2364 1344.8334 1349.2607 1361.4220 1366.2265 1366.4533 1373.3594 1388.1239 1395.7096 1414.0101 1429.1358 1433.5233 1444.4040 1447.8310 1455.9616 1462.0242 1462.1414 1475.2073 1491.9797 1540.9727 1578.2735 1603.1306 1610.2019 2948.8386 2964.8491 2979.0387 2991.7367 2995.7917 3032.9883 3048.8545 3056.0975 3065.8259 3087.8032 3097.5090 3165.9436 3170.5133 3177.7772 3191.1986 3253.1513 3557.0617
redmass: 8.3657 6.6898 4.1770 6.5184 6.1928 8.6962 5.7609 9.4876 6.1846 7.2942 5.6542 6.5791 5.3241 5.2634 5.4098 2.4475 6.2372 4.1133 6.4211 18.2176 3.2508 2.2977 4.9607 5.5320 3.2625 3.5645 3.4329 3.2371 5.8328 8.3134 5.2380 1.8157 5.6366 1.7945 1.8871 5.0848 6.6612 5.3341 5.3230 8.0850 7.1646 5.8851 5.2064 5.5351 6.4164 3.0963 6.0878 3.0072 1.6905 1.6329 1.4175 6.3110 2.4688 2.6403 4.4781 1.4322 1.9992 1.7877 2.5067 2.0022 1.4015 2.5445 3.0361 6.2398 2.2463 3.7723 2.0474 2.1606 2.6459 2.7770 1.5871 2.8218 1.4601 1.4546 2.7140 1.7943 5.9652 1.6367 1.3455 1.3800 1.3288 2.2936 3.0856 3.6881 1.6325 1.4104 1.4158 1.4314 1.4525 1.2735 3.2579 8.2923 1.7281 1.5783 4.8334 4.3755 2.6566 1.7901 1.8139 1.1098 1.1027 1.3529 1.3383 1.0920 3.5229 8.3198 6.7659 8.1931 6.3895 1.0689 1.0844 1.0647 1.0607 1.0609 1.0597 1.0972 1.1016 1.1036 1.0968 1.1041 1.0922 1.0898 1.0928 1.0970 1.0987 1.0778
irintensity: 0.2906 0.1552 0.6349 0.7878 2.0963 0.6178 1.8184 3.3669 0.3540 1.1942 0.7316 4.5713 1.9480 2.1129 2.5897 2.7174 0.9217 1.5212 2.5821 1.2658 0.8397 0.8034 5.2917 0.5393 2.7625 0.5216 16.5561 4.2190 11.9036 5.6254 8.8629 3.9745 14.5756 53.2741 46.2203 28.2477 10.7368 26.7893 25.1468 3.4737 5.3779 14.1938 0.5538 13.7270 14.5234 10.8449 13.4143 5.7345 17.5791 1.3845 29.8967 3.2643 11.6732 44.9550 27.2102 11.3400 13.6364 14.1836 36.8311 1.3022 1.9476 38.8343 138.0241 91.4814 4.2571 25.4757 6.6682 15.5595 2.7834 3.5644 6.5092 11.6281 7.0971 57.9459 12.3572 101.3349 292.1785 47.4753 25.6631 10.9977 20.3055 36.8549 44.1842 55.4312 9.4848 19.8103 2.4382 7.7750 52.8547 15.3042 58.8007 102.0597 2.5585 23.9087 3.8555 31.0659 124.6386 27.4254 71.1128 2.4416 11.3221 32.4506 23.2462 14.7791 3.7117 54.2989 44.5408 94.2736 605.6200 55.9867 6.3478 30.3028 35.2828 21.8569 29.5879 38.2944 36.9512 41.2292 32.8756 1.1517 11.7617 1.3407 7.5679 2.3260 1.3133 56.1784
temp: 298.150 k
press: 1.00000 atm
elementType: 17 8 8 8 7 7 7 7 7 7 6 6 6 6 6 6 6 6 6 6 6 6 6 6 6 6 6 1 1 1 1 1 1 1 1 1 1 1 1 1 1 1 1 1
symmnumber: 1
zpe: 872110.8 jmol-1
zpe.correction: 0.332169 hartree
zpe.thermalcorrener: 0.355338 hartree
zpe.thermalcorrenthalpy: 0.356282 hartree
zpe.thermalcorrgfe: 0.274732 hartree
zpe.sumelectzpe: -1670.227239 hartree
zpe.sumelectthermal: -1670.204071 hartree
zpe.sumelectthermalent: -1670.203126 hartree
zpe.sumelectthermalfe: -1670.284677 hartree
dipole: -4.9010 -3.5978 0.0062
dipole: 6.0798
quadrupole: -126.4662 -181.6915 -161.0656
quadrupole: -24.7469 -0.1461 2.1315
quadrupole: 29.9416 -25.2837 -4.6578 -24.7469 -0.1461 2.1315
hfenergy: -1670.5594088 hartree
pointgroup: C01 [X(C17H17Cl1N6O3)]
dipole: -1.9286747 0.6598058 -1.2516038 debye
polarizability: 317.9318562|-2.4627849|189.1661949|3.605115|-32.2741618|257.9143805 unknown
InChI: InChI=1S/C17H17ClN6O3/c18-13-5-4-12(24(25)26)7-11(13)8-19-16-15-17(21-9-20-16)23(10-22-15)14-3-1-2-6-27-14/h4-5,7,9-10,14,19H,1-3,6,8H2
charge 0 multiplicity 1
44 atoms
Cl 3.772262 1.467399 -3.159709
O  -4.859471 -1.515174 -0.999882
O  5.490046 -2.471999 2.071163
O  4.064369 -1.043812 3.134582
N  -3.264876 0.135067 -0.550349
N  -1.727569 1.021999 -2.004944
N  -1.934267 0.21986 1.550251
N  1.055668 1.88779 -0.960445
N  0.311281 1.149684 1.172452
N  4.68365 -1.462629 2.083176
C  -4.503995 -0.456281 -0.043599
C  -5.647852 0.57031 0.096125
C  -6.94268 -0.148737 0.546204
C  -7.279702 -1.306428 -0.422805
C  -6.069197 -2.248001 -0.56043
C  -2.126385 0.415822 0.212729
C  -2.96893 0.516445 -1.86878
C  -1.192051 0.965979 -0.704459
C  0.07596 1.339673 -0.16993
C  2.383989 2.244491 -0.44176
C  -0.688492 0.614629 1.943516
C  3.351222 1.061933 -0.416524
C  3.575705 0.357936 0.788885
C  4.038486 0.610357 -1.570018
C  4.4598 -0.7401 0.806337
C  4.924577 -0.486661 -1.557327
C  5.142363 -1.176547 -0.350047
H  -4.263771 -0.894448 0.949263
H  -5.806121 1.063334 -0.882359
H  -5.349293 1.34663 0.824417
H  -7.77798 0.572455 0.599616
H  -6.802138 -0.553397 1.569619
H  -8.152184 -1.882435 -0.05911
H  -7.53952 -0.89973 -1.419042
H  -5.856139 -2.748372 0.409945
H  -6.221005 -3.017527 -1.334216
H  -3.677326 0.366912 -2.678539
H  0.86465 1.959938 -1.961595
H  2.255932 2.623599 0.584909
H  2.788732 3.053354 -1.073523
H  -0.450662 0.48385 3.003195
H  3.042704 0.651628 1.697356
H  5.433062 -0.794378 -2.47481
H  5.818648 -2.032817 -0.292339
