program: Gaussian 09
title: 000286518
version: EM64L-G09RevD.01
frameworkgroup: C1[X(C14H11NO)]
method: RPBEPBE
basis: SDD
operation: Freq
keyword: #p
keyword: freq=noraman
keyword: PBEPBE/SDD
title: #p freq=noraman PBEPBE/SDD
converged: YES YES NO NO
title: Mulliken charges:
elementType: O N C C C C C C C C C C C C C C H H H H H H H H H H H
charge: -0.265250 -0.455470 -0.732696 0.418230 0.432048 0.294620 0.138950 -0.008464 -0.416803 -0.423631 -0.398535 -0.350204 -0.249121 -0.222227 -0.222298 -0.241524 0.225845 0.247636 0.324128 0.231799 0.232441 0.236820 0.276585 0.230967 0.230739 0.231010 0.234404
chargesum: 0.00000
title: Mulliken charges with hydrogens summed into heavy atoms:
elementType: O N C C C C C C C C C C C C C C
charge: -0.265250 -0.131342 -0.259214 0.418230 0.432048 0.294620 0.138950 -0.008464 -0.185003 -0.191190 -0.161715 -0.073619 -0.018154 0.008512 0.008712 -0.007120
polarizability: 2.09918867e+02 5.14951579e+00 1.70695555e+02 1.59073157e-02 -6.32284213e+00 8.98673138e+01
1716.lowfreq: -12.1150 0.0004 0.0005 0.0009 3.7514 10.3289 54.9039 82.9204 124.2364
frequency: 54.8997 82.9111 124.2330 153.8275 205.8379 257.5161 307.5493 327.1857 344.0079 352.7552 422.2818 444.6691 472.6205 493.8786 523.7220 559.6361 605.4258 615.8167 632.9541 657.0947 694.6514 733.2312 746.1245 750.5876 763.8928 789.9374 800.8511 830.5195 866.2277 887.5903 900.3386 928.6785 948.0656 968.4962 980.8854 998.0303 1035.6499 1040.6321 1076.7616 1104.9206 1126.7190 1167.7109 1174.3956 1176.6704 1200.8456 1212.2488 1242.3329 1275.5217 1280.5181 1324.1729 1331.4073 1375.1473 1383.5171 1414.7286 1439.5743 1455.2395 1463.2215 1476.6642 1491.7238 1569.8688 1593.8913 1606.6110 1611.9043 1617.3574 2970.6799 3060.7730 3122.8199 3123.5653 3127.5356 3139.2653 3145.5311 3154.5059 3166.8494 3170.0446 3486.3150
redmass: 4.9283 5.0498 5.0908 4.0828 4.8336 4.4644 5.0948 3.1046 4.0568 7.2805 3.4865 3.5218 3.2996 4.8019 3.8301 4.7305 5.6490 4.0926 2.5455 3.9857 4.1329 2.9701 2.3997 1.9790 1.4571 1.9649 3.7460 2.7844 1.6138 1.8110 3.1581 1.7802 1.5222 1.4198 1.3266 1.3455 2.7651 2.1930 2.9177 2.1911 1.7711 1.1153 1.0600 1.0670 2.6188 2.3557 2.0419 1.3243 1.6201 1.7032 3.6733 3.4789 6.6435 2.4998 2.5378 2.3967 1.2050 2.3777 2.7190 5.4586 7.3630 5.2868 6.5165 5.2245 1.0658 1.0952 1.0867 1.0868 1.0896 1.0897 1.0933 1.0942 1.1006 1.0996 1.0746
irintensity: 1.3014 1.1042 1.7051 0.3222 0.7916 2.4648 7.8075 2.3219 1.1119 2.7818 0.6727 7.3897 2.9962 9.3210 5.3229 1.9485 11.0032 15.6705 26.4485 1.4689 0.6357 6.6365 41.2761 51.3139 120.1882 17.6052 16.2387 3.9267 1.1465 1.5893 3.8726 0.2602 2.7671 3.7044 0.0643 0.9050 7.1932 6.4284 0.2780 10.3491 46.3267 0.3199 0.1017 1.5120 1.5391 0.5381 29.8222 1.2608 4.8674 4.5566 302.9489 15.4403 11.4804 10.7937 48.4293 10.5637 14.0634 8.0218 67.5829 138.9265 84.6533 39.7533 2.5134 95.7303 18.4946 13.6430 5.0359 6.9313 2.7924 12.6714 22.0110 15.2799 27.7996 20.9260 27.3493
temp: 298.150 k
press: 1.00000 atm
elementType: 8 7 6 6 6 6 6 6 6 6 6 6 6 6 6 6 1 1 1 1 1 1 1 1 1 1 1
symmnumber: 1
zpe: 557249.1 jmol-1
zpe.correction: 0.212245 hartree
zpe.thermalcorrener: 0.224011 hartree
zpe.thermalcorrenthalpy: 0.224955 hartree
zpe.thermalcorrgfe: 0.174298 hartree
zpe.sumelectzpe: -668.998366 hartree
zpe.sumelectthermal: -668.986600 hartree
zpe.sumelectthermalent: -668.985656 hartree
zpe.sumelectthermalfe: -669.036314 hartree
dipole: -2.0138 -3.1059 -0.4630
dipole: 3.7304
quadrupole: -83.2237 -91.4915 -93.7560
quadrupole: -9.4522 -1.8492 -4.5442
quadrupole: 6.2667 -2.0011 -4.2656 -9.4522 -1.8492 -4.5442
hfenergy: -669.2106113 hartree
pointgroup: C01 [X(C14H11N1O1)]
dipole: -0.795783 -1.2262576 -0.1306329 debye
polarizability: 209.928532|4.9937759|170.0987818|-1.1410135|-9.3263992|90.4544217 unknown
InChI: InChI=1S/C14H11NO/c16-14-12-7-3-1-5-10(12)9-11-6-2-4-8-13(11)15-14/h1-8,15H,9H2
charge 0 multiplicity 1
27 atoms
O  1.331043 2.90361 0.283809
N  -0.653223 1.746543 0.307617
C  -0.132961 -0.922213 1.351562
C  -1.382515 -0.617708 0.54111
C  1.13491 -0.769489 0.52276
C  -1.597092 0.704455 0.063739
C  1.52444 0.50396 0.015845
C  0.750556 1.772331 0.228945
C  -2.359445 -1.603198 0.27296
C  1.962502 -1.888525 0.263237
C  -2.797245 1.028535 -0.620566
C  2.741924 0.634699 -0.703647
C  -3.549974 -1.288994 -0.420008
C  3.158827 -1.757857 -0.475014
C  -3.771627 0.037484 -0.856711
C  3.553629 -0.487701 -0.956942
H  -0.191092 -1.945378 1.760377
H  -0.089729 -0.227012 2.215382
H  -1.035123 2.698565 0.350397
H  -2.192312 -2.624909 0.63419
H  1.668291 -2.869641 0.654356
H  -2.9546 2.052151 -0.981757
H  3.031272 1.633203 -1.046168
H  -4.299291 -2.065062 -0.607366
H  3.784174 -2.637751 -0.662913
H  -4.692875 0.297639 -1.389012
H  4.485432 -0.375539 -1.521185
