program: Gaussian 09
title: 000286507
version: EM64L-G09RevD.01
frameworkgroup: C1[X(C13H10N2O3)]
method: RPBEPBE
basis: SDD
operation: Freq
keyword: #p
keyword: freq=noraman
keyword: PBEPBE/SDD
title: #p freq=noraman PBEPBE/SDD
converged: YES YES NO YES
title: Mulliken charges:
elementType: O O O N N C C C C C C C C C C C C C H H H H H H H H H H
charge: -0.261587 -0.419112 -0.245828 -0.448525 -0.088984 -0.186353 0.479760 0.378067 -0.436764 -0.356286 -0.217381 -0.320406 -0.176034 -0.374899 0.214655 -0.293045 -0.212909 0.168053 0.238484 0.314194 0.232567 0.249460 0.354248 0.234315 0.248983 0.255096 0.289208 0.381024
chargesum: 0.00000
title: Mulliken charges with hydrogens summed into heavy atoms:
elementType: O O O N N C C C C C C C C C C C C C
charge: -0.261587 -0.038088 -0.245828 -0.094278 -0.088984 -0.186353 0.479760 0.378067 -0.198280 -0.042092 0.015185 -0.070946 0.058281 -0.125916 0.214655 -0.037949 0.076299 0.168053
polarizability: 3.30015482e+02 -7.82462690e+00 1.97628533e+02 -1.27716666e-02 -6.66475835e-03 6.31509576e+01
1716.lowfreq: -0.0009 -0.0006 0.0004 1.5761 2.7769 9.8636 32.7084 44.5557 51.2082
frequency: 32.6853 44.4874 51.2075 81.2521 139.7020 144.9137 160.3211 184.8998 200.2628 204.3616 273.6047 289.6456 303.1266 429.9336 431.2181 459.6373 469.6278 522.6496 526.7228 565.3685 577.6190 587.9318 607.2124 647.4320 656.7265 688.1331 731.5948 771.9081 789.2050 799.9224 803.9282 849.7084 855.4743 866.6419 913.7819 920.0799 927.4334 947.0121 963.0169 989.1876 997.3752 998.0695 1028.7677 1051.7250 1062.9088 1079.6872 1142.3594 1159.1652 1192.1121 1217.9574 1226.1927 1244.2830 1283.1389 1306.4175 1325.9898 1353.7736 1376.3186 1413.7752 1425.4394 1452.0449 1480.4461 1523.8450 1568.3887 1579.6431 1592.1782 1620.0311 1632.0998 1659.4682 3118.8172 3132.4564 3133.0011 3138.6920 3157.0797 3169.4350 3172.1063 3194.9108 3362.1362 3520.5616
redmass: 6.7030 8.4475 7.1364 6.9529 6.7051 5.5024 3.3132 4.4291 3.3965 8.0955 7.1819 11.4372 4.0508 3.8479 4.6994 5.3829 3.2332 7.1676 6.4924 2.0276 6.0773 2.4248 6.6214 2.6036 2.4146 6.4960 8.4132 1.3072 6.4369 5.4882 2.0036 2.2164 1.1560 5.6219 2.1331 5.8844 1.3563 1.4373 4.1908 1.3634 1.3320 1.1032 3.0089 2.4341 2.0058 2.5291 1.3633 1.5067 1.2407 1.4517 1.9641 1.8174 2.4006 1.6416 2.4808 3.3229 2.0365 2.1934 5.4810 2.8011 3.1181 2.7152 6.6358 7.6198 5.7424 5.9055 8.6404 6.3180 1.0925 1.0878 1.0878 1.0922 1.0963 1.0924 1.0991 1.0949 1.0768 1.0641
irintensity: 1.9632 0.0734 0.6498 1.4491 7.6874 3.9359 0.4370 7.3998 1.2285 0.1943 1.5741 2.0811 4.3077 3.8939 1.8782 57.8181 0.2752 0.3884 10.2019 37.4253 50.6486 41.7698 1.3143 31.8712 43.0057 0.2330 24.1210 12.4983 29.7957 0.3251 64.7715 74.2826 58.3411 2.1358 3.8026 3.2339 5.9080 0.0759 0.4727 0.1318 21.5336 53.1765 7.8973 309.4075 152.5396 37.6504 10.3786 1.9493 12.9425 23.9507 2.9167 6.4560 1.1853 20.8222 195.8260 77.7483 0.3836 6.2475 147.1939 11.0068 152.7934 352.8315 11.3908 160.9807 9.5598 2.1650 235.0934 80.6750 1.7595 0.7046 6.5672 14.5884 28.4651 1.8887 29.0843 3.6266 135.5416 61.1127
temp: 298.150 k
press: 1.00000 atm
elementType: 8 8 8 7 7 6 6 6 6 6 6 6 6 6 6 6 6 6 1 1 1 1 1 1 1 1 1 1
symmnumber: 1
zpe: 541324.4 jmol-1
zpe.correction: 0.206180 hartree
zpe.thermalcorrener: 0.221099 hartree
zpe.thermalcorrenthalpy: 0.222043 hartree
zpe.thermalcorrgfe: 0.162516 hartree
zpe.sumelectzpe: -835.327905 hartree
zpe.sumelectthermal: -835.312986 hartree
zpe.sumelectthermalent: -835.312041 hartree
zpe.sumelectthermalfe: -835.371569 hartree
dipole: -4.2164 1.4579 0.0002
dipole: 4.4614
quadrupole: -75.0796 -103.4702 -107.5234
quadrupole: -1.4981 -0.0022 -0.0005
quadrupole: 20.2782 -8.1125 -12.1657 -1.4981 -0.0022 -0.0005
hfenergy: -835.5340847 hartree
pointgroup: C01 [X(C13H10N2O3)]
dipole: 1.6795842 0.5097467 -0.0000947 debye
polarizability: 330.419813|2.7446506|197.2242013|-0.0125076|0.0071481|63.1509576 unknown
InChI: InChI=1S/C13H10N2O3/c16-11(6-7-12(17)18)15-10-5-1-3-9-4-2-8-14-13(9)10/h1-8,15,17H
charge 0 multiplicity 1
28 atoms
O  -1.750894 -1.995959 0.000259
O  -6.360512 0.117236 0.00019
O  -5.042766 2.037674 0.00029
N  -0.331077 -0.121058 0.000425
N  1.732452 1.551951 0.000294
C  2.044116 0.201656 0.000138
C  3.398112 -0.292617 -0.000073
C  0.935754 -0.729269 0.000219
C  3.625109 -1.706831 -0.000203
C  1.187076 -2.112115 0.000096
C  2.535311 -2.582841 -0.000118
C  4.445158 0.686209 -0.000136
C  4.12385 2.046379 0.000012
C  2.747317 2.436747 0.000229
C  -1.58155 -0.735216 0.00055
C  -2.713181 0.239427 0.000412
C  -4.007192 -0.184397 0.000254
C  -5.125629 0.78426 0.000125
H  4.652412 -2.088273 -0.000365
H  0.34556 -2.807248 0.00016
H  2.708138 -3.664441 -0.000215
H  5.490045 0.355268 -0.000299
H  -0.254979 0.910336 0.000432
H  4.902207 2.815084 -0.000031
H  2.471406 3.497228 0.00035
H  -2.500549 1.317428 0.00044
H  -4.242836 -1.253336 0.000223
H  -7.094658 0.789714 0.000241
