program: Gaussian 09
title: 000286557
version: EM64L-G09RevD.01
frameworkgroup: C1[X(C16H8Cl2N2O4)]
method: RPBEPBE
basis: SDD
operation: Freq
keyword: #p
keyword: freq=noraman
keyword: PBEPBE/SDD
title: #p freq=noraman PBEPBE/SDD
converged: YES YES NO NO
title: Mulliken charges:
elementType: Cl Cl O O O O N N C C C C C C C C C C C C C C C C H H H H H H H H
charge: -0.022222 -0.028254 -0.119172 -0.169276 -0.204729 -0.158320 -0.043961 -0.014418 0.150028 -0.049238 0.086831 0.366833 0.331158 0.086431 -0.292586 -0.349098 -0.303421 -0.344035 -0.214228 -0.203366 -0.221436 -0.210351 -0.112545 -0.110435 0.251798 0.281508 0.273320 0.283928 0.264948 0.266126 0.263740 0.264444
chargesum: 0.00000
title: Mulliken charges with hydrogens summed into heavy atoms:
elementType: Cl Cl O O O O N N C C C C C C C C C C C C C C C C
charge: -0.022222 -0.028254 -0.119172 -0.169276 -0.204729 -0.158320 -0.043961 -0.014418 0.150028 -0.049238 0.086831 0.366833 0.331158 0.086431 -0.040788 -0.067590 -0.030101 -0.060107 0.050720 0.062760 0.042304 0.054093 -0.112545 -0.110435
polarizability: 4.18988013e+02 -7.63770257e+00 1.99787177e+02 -1.40733320e+01 -7.79835287e+00 1.34238658e+02
1716.lowfreq: -3.9323 -0.0020 0.0015 0.0015 1.5029 5.8236 10.7323 22.5526 33.2011
frequency: 10.6249 22.4971 33.1957 45.5225 57.8994 75.8989 86.1967 94.7428 119.1658 132.4029 176.7697 190.1057 215.0094 247.6547 254.3348 269.4215 296.8321 301.0106 312.5379 325.5301 344.2466 382.0268 404.7367 405.7980 441.9967 464.9266 471.6377 476.6603 503.6786 529.4599 555.1834 612.7218 621.5145 626.4471 652.0099 677.8103 689.8719 708.7212 716.0807 733.9402 752.3522 766.5554 830.6520 831.7426 847.4359 852.8259 857.8664 904.9410 965.1118 966.8851 987.9894 990.5941 998.3736 1000.6578 1018.7148 1072.3060 1073.5273 1095.7609 1115.2078 1115.7891 1183.7783 1189.9822 1204.2081 1238.7421 1290.9110 1296.6964 1299.1548 1368.5489 1374.8504 1385.5359 1400.4396 1405.7467 1414.4685 1475.4568 1475.8611 1528.7961 1559.1214 1576.9952 1585.5793 1596.8198 1599.3902 1631.4730 3152.1862 3157.8037 3158.1782 3166.5198 3177.5750 3177.8820 3180.9913 3185.4094
redmass: 13.2897 11.3858 4.1666 4.7229 11.5048 10.5800 10.2604 11.7785 12.1241 13.5244 11.2212 11.5329 11.3147 8.7764 9.3023 10.0836 7.6002 7.6777 12.6024 10.5729 9.3536 8.0611 2.8757 2.9024 10.3315 4.4348 5.8888 4.2560 10.4920 7.0942 9.1180 7.7819 7.1842 7.5820 7.4518 9.4131 5.1646 5.5040 7.1259 7.6879 3.9680 4.4107 1.3095 1.3156 3.2338 1.6501 2.3060 7.9425 1.3791 1.3684 1.3697 1.3663 4.3048 3.8615 8.7434 3.3144 2.9157 5.2250 1.3424 1.3506 1.2149 1.1430 4.4757 5.1207 6.2149 1.2583 1.2633 5.1158 4.9629 10.2987 5.2353 4.4239 6.8267 2.4111 2.4485 11.4667 9.7741 7.7987 8.6959 6.2092 6.4655 13.8015 1.0895 1.0889 1.0892 1.0893 1.0970 1.0964 1.0974 1.0971
irintensity: 0.4394 0.2190 0.0885 0.1424 0.0288 1.7689 2.3821 2.8073 0.5771 1.3591 6.0556 11.3948 3.5952 3.9336 2.2832 3.0085 0.7308 0.9485 37.3950 3.1551 4.6687 1.5618 0.0308 0.3768 4.0637 2.9893 31.1038 13.4300 13.9425 62.0294 8.9642 12.0711 3.0130 5.3973 5.3864 26.6608 16.2233 1.7431 0.6024 22.2812 37.1466 26.6312 4.6408 8.5248 158.2628 46.7698 151.0475 76.8583 1.2340 1.1612 1.4246 1.8352 62.5334 3.4592 27.8281 136.6200 43.2749 8.1886 12.2862 11.8020 39.3576 35.7903 8.6208 78.7901 490.3571 2.0239 5.7776 1.6237 16.3982 105.5748 2.8494 36.4183 133.0305 52.8488 6.7512 302.0740 192.1946 33.7128 138.2616 179.1406 89.6673 238.3422 4.8172 0.3514 0.1897 0.7486 3.1676 2.4087 1.0542 1.6306
temp: 298.150 k
press: 1.00000 atm
elementType: 17 17 8 8 8 8 7 7 6 6 6 6 6 6 6 6 6 6 6 6 6 6 6 6 1 1 1 1 1 1 1 1
symmnumber: 1
zpe: 536951.1 jmol-1
zpe.correction: 0.204514 hartree
zpe.thermalcorrener: 0.225340 hartree
zpe.thermalcorrenthalpy: 0.226284 hartree
zpe.thermalcorrgfe: 0.150955 hartree
zpe.sumelectzpe: -1943.240560 hartree
zpe.sumelectthermal: -1943.219733 hartree
zpe.sumelectthermalent: -1943.218789 hartree
zpe.sumelectthermalfe: -1943.294118 hartree
dipole: 0.1928 -1.1243 -0.6187
dipole: 1.2977
quadrupole: -146.8834 -155.9844 -149.6524
quadrupole: -3.9965 0.5134 0.1379
quadrupole: 3.9566 -5.1443 1.1877 -3.9965 0.5134 0.1379
hfenergy: -1943.4450734 hartree
pointgroup: C01 [X(C16H8Cl2N2O4)]
dipole: 0.4446077 0.2509682 0.0015477 debye
polarizability: 194.1583503|-64.6718306|394.1018947|43.6316739|-29.9202932|164.753603 unknown
InChI: InChI=1S/C16H8Cl2N2O4/c17-11-5-1-9(2-6-11)15(21)13(19-23)14(20-24)16(22)10-3-7-12(18)8-4-10/h1-8H
charge 0 multiplicity 1
32 atoms
Cl -0.669398 7.185489 -1.021324
Cl 3.731859 -6.468552 1.387967
O  -1.856534 -1.388506 -2.112964
O  -0.905102 0.905225 1.731257
O  1.701278 -0.035568 0.327949
O  -3.084577 0.834275 -1.713355
N  -2.084864 0.150678 -1.384655
N  -0.718369 -1.868183 -1.530832
C  -1.039914 0.216308 -0.541815
C  -0.233874 -0.982255 -0.633237
C  -0.922244 1.290761 0.530337
C  -0.868439 2.712983 0.1170
C  1.692319 -2.452797 0.328492
C  1.101339 -1.1186 0.037001
C  -0.710062 3.099108 -1.241045
C  -0.961837 3.713438 1.124176
C  0.985455 -3.678437 0.178992
C  3.031516 -2.477839 0.811767
C  -0.645373 4.460656 -1.5934
C  -0.903621 5.076282 0.785467
C  1.604043 -4.903298 0.500471
C  3.659588 -3.692911 1.133966
C  -0.747185 5.429171 -0.573339
C  2.932187 -4.89242 0.971757
H  -0.61515 2.342912 -2.027047
H  -1.076785 3.401656 2.167152
H  -0.04353 -3.684321 -0.188195
H  3.560754 -1.527112 0.930538
H  -0.518302 4.766382 -2.6352
H  -0.976442 5.851309 1.553254
H  1.064098 -5.847513 0.38936
H  4.688569 -3.714726 1.503007
