program: Gaussian 09
title: 000282527
version: EM64L-G09RevD.01
frameworkgroup: C1[X(C10H22O6S3)]
method: RPBEPBE
basis: SDD
operation: Freq
keyword: #p
keyword: freq=noraman
keyword: PBEPBE/SDD
title: #p freq=noraman PBEPBE/SDD
converged: YES YES NO NO
title: Mulliken charges:
elementType: S S S O O O O O O C C C C C C C C C C H H H H H H H H H H H H H H H H H H H H H H
charge: 0.092370 1.066765 1.046869 -0.395991 -0.404870 -0.529599 -0.502560 -0.522434 -0.511088 -0.370427 -0.361363 -0.318740 -0.311621 -0.681804 -0.289776 -0.340433 -0.693203 -0.735542 -0.722737 0.294614 0.229592 0.231728 0.235930 0.269739 0.236555 0.260494 0.275346 0.242984 0.231131 0.215471 0.196056 0.189101 0.217874 0.212337 0.212574 0.283459 0.280334 0.304310 0.289845 0.283623 0.293085
chargesum: 0.00000
title: Mulliken charges with hydrogens summed into heavy atoms:
elementType: S S S O O O O O O C C C C C C C C C C
charge: 0.092370 1.066765 1.046869 -0.395991 -0.404870 -0.529599 -0.502560 -0.522434 -0.511088 -0.075814 0.099957 0.186930 0.185429 -0.163474 0.156827 0.044725 -0.050418 0.132562 0.143815
polarizability: 2.44132664e+02 -6.56090865e+00 2.02262614e+02 9.54992190e+00 2.44639444e-01 1.65735700e+02
1716.lowfreq: -5.6322 -2.4525 -0.0018 -0.0016 0.0017 7.8459 21.8528 26.4097 35.0220
frequency: 21.3251 26.1260 34.6884 42.3423 47.1384 55.4253 62.2713 68.2852 74.5535 91.7921 106.0451 123.7400 140.5632 157.6000 159.8118 170.6240 189.8368 197.3529 204.5585 219.7176 223.0665 232.2639 238.0961 243.7649 275.7627 279.4343 312.6630 319.1101 339.1501 344.5819 380.5133 383.3154 393.3737 404.2899 431.6622 464.4809 489.5922 561.3444 587.2496 601.1392 642.7797 678.7057 724.8683 768.7615 807.4838 825.0021 830.8291 837.4064 880.6912 891.0993 904.5107 908.0776 922.5418 950.5184 957.8060 996.6081 1001.1765 1025.1973 1028.7651 1032.7979 1054.8715 1069.2047 1071.5689 1078.7783 1100.0572 1124.7802 1162.9249 1204.4394 1210.8002 1232.9773 1243.6594 1263.3245 1270.0711 1292.4419 1305.5992 1306.7945 1318.1493 1318.4957 1341.8346 1346.8016 1351.0054 1373.4680 1387.5246 1410.0760 1415.4552 1417.7560 1429.0233 1435.4359 1442.1997 1447.4772 1453.2920 1469.1510 1474.6124 1478.1857 1489.3436 2963.8799 2964.4813 2974.0618 2981.7378 2988.8308 2990.9679 3004.1875 3008.5930 3009.5506 3010.8890 3026.8753 3041.6727 3047.0702 3047.4033 3057.2183 3071.1554 3073.1986 3082.7807 3158.1586 3185.0907 3190.0489 3199.1447
redmass: 4.6416 5.0837 4.6528 4.8364 5.6056 3.2982 3.6592 3.4039 4.5545 5.9940 2.5641 5.1537 5.2930 1.2752 2.1429 5.0048 2.3615 2.6608 3.6183 1.7429 2.1431 1.4586 3.7240 3.9778 4.6934 6.7556 4.1514 3.6327 7.3969 9.9372 2.8698 6.0863 3.0047 3.6871 3.7001 6.3245 5.7275 4.3940 8.5533 8.2164 3.8406 6.2793 1.0846 1.1828 3.4270 4.5767 11.3169 3.9845 4.0664 1.7738 1.7102 1.9359 3.3192 1.6474 2.3352 1.3848 1.3381 3.8026 3.1686 1.8246 1.7748 2.4738 1.5007 1.7079 2.2134 2.3770 1.2093 1.4346 1.1174 1.2036 1.2193 1.2247 1.1937 1.1128 1.2389 1.2148 1.1304 1.1322 1.2173 1.4041 1.4706 1.3206 1.2094 1.0467 1.0515 1.0502 1.0536 1.0766 1.0802 1.0754 1.0800 1.0676 1.0430 1.0664 1.0838 1.0585 1.0573 1.0362 1.0600 1.0625 1.0606 1.0839 1.0803 1.0476 1.0549 1.1048 1.0248 1.1003 1.1021 1.1037 1.1011 1.1000 1.1054 1.1067 1.1076 1.1078 1.1077
irintensity: 0.2846 3.0033 0.3612 0.6013 1.5257 3.7392 2.4864 2.0037 0.9342 5.9635 0.1581 3.1971 13.4998 1.6934 2.4173 5.8875 1.5361 2.2795 1.2690 4.8960 0.2824 2.7341 7.6067 0.3998 3.9417 9.1663 5.2311 1.2311 26.9932 25.9032 2.9851 34.0138 3.2345 3.1324 7.6589 70.3689 72.7161 3.7547 26.9090 50.2524 23.5161 11.6551 9.2217 1.0180 7.7369 27.7981 115.4322 14.2004 96.4754 6.3535 13.2763 25.8672 48.5384 11.6130 11.6910 24.1664 32.0893 2.7963 44.7979 48.0370 85.7365 1.2957 7.5349 9.9800 10.6940 0.2496 4.5220 2.3537 3.8835 10.1052 7.5685 8.1570 1.3759 1.2931 3.6444 3.7374 10.6451 1.4503 27.3763 4.0113 4.5478 6.2537 9.3834 3.4977 13.1397 13.0156 9.1472 22.5856 5.4501 16.0833 11.7266 2.3899 12.0285 4.6909 24.1710 34.5762 22.6792 34.4431 17.7735 15.0833 10.3295 4.0413 14.0592 12.0879 37.3066 6.5866 0.3062 5.8301 10.8471 10.8804 38.6397 54.6049 44.9531 22.1723 0.3586 0.1059 0.0185
temp: 298.150 k
press: 1.00000 atm
elementType: 16 16 16 8 8 8 8 8 8 6 6 6 6 6 6 6 6 6 6 1 1 1 1 1 1 1 1 1 1 1 1 1 1 1 1 1 1 1 1 1 1
symmnumber: 1
zpe: 838479.7 jmol-1
zpe.correction: 0.319360 hartree
zpe.thermalcorrener: 0.345392 hartree
zpe.thermalcorrenthalpy: 0.346336 hartree
zpe.thermalcorrgfe: 0.260651 hartree
zpe.sumelectzpe: -2037.866472 hartree
zpe.sumelectthermal: -2037.840439 hartree
zpe.sumelectthermalent: -2037.839495 hartree
zpe.sumelectthermalfe: -2037.925180 hartree
dipole: -4.8123 -2.6697 2.1477
dipole: 5.9075
quadrupole: -135.3609 -134.7619 -140.4674
quadrupole: 12.5747 25.8126 -0.6508
quadrupole: 1.5025 2.1015 -3.6040 12.5747 25.8126 -0.6508
hfenergy: -2038.1858317 hartree
pointgroup: C01 [X(C10H22O6S3)]
dipole: 1.9162388 1.2085032 0.51902 debye
polarizability: 243.2232551|-8.5434259|200.5804711|-11.7531836|-7.1225614|168.3272509 unknown
InChI: InChI=1S/C10H22O6S3/c1-4-5-8-17-10(9-16-19(3,13)14)6-7-15-18(2,11)12/h10H,4-9H2,1-3H3
charge 0 multiplicity 1
41 atoms
S  -0.674466 -0.065693 1.195474
S  -4.253809 0.028067 -0.350781
S  3.314415 0.721849 -0.723144
O  -2.849525 1.162457 -0.939559
O  2.368483 2.334999 -0.74783
O  -3.727512 -1.508363 -0.43005
O  -5.600712 0.470174 -1.120116
O  2.632359 -0.354198 -1.729143
O  3.618216 0.296066 0.810504
C  -0.443043 0.657067 -0.559731
C  -0.10557 2.155094 -0.396346
C  -1.674801 0.430428 -1.449747
C  1.259277 2.447656 0.23985
C  -0.539701 -1.938189 0.889183
C  0.887197 -2.42174 0.590362
C  0.953909 -3.963451 0.454426
C  2.386665 -4.456719 0.156008
C  -4.312182 0.619244 1.449167
C  4.848191 1.465181 -1.548617
H  0.406107 0.118914 -1.025161
H  -0.895196 2.637096 0.213499
H  -0.140741 2.641179 -1.390918
H  -1.48961 0.824006 -2.469215
H  -1.909589 -0.650826 -1.529423
H  1.329603 3.501333 0.566946
H  1.458649 1.792877 1.112259
H  -1.259162 -2.1973 0.092375
H  -0.921865 -2.372293 1.831401
H  1.264887 -1.959787 -0.341725
H  1.567638 -2.088374 1.397601
H  0.270735 -4.294666 -0.354032
H  0.585267 -4.434526 1.388886
H  2.766701 -4.01482 -0.783898
H  2.4227 -5.557217 0.055861
H  3.080842 -4.165258 0.966365
H  -4.566372 1.686396 1.397262
H  -5.089572 0.020489 1.943939
H  -3.296117 0.437632 1.831892
H  5.229662 2.22288 -0.852941
H  5.545972 0.629921 -1.698128
H  4.498669 1.899814 -2.493957
