program: Gaussian 09
title: 000282518
version: EM64L-G09RevD.01
frameworkgroup: C1[X(C12H17N5O5)]
method: RPBEPBE
basis: SDD
operation: Freq
keyword: #p
keyword: freq=noraman
keyword: PBEPBE/SDD
title: #p freq=noraman PBEPBE/SDD
converged: YES YES NO NO
title: Mulliken charges:
elementType: O O O O O N N N N N C C C C C C C C C C C C H H H H H H H H H H H H H H H H H
charge: -0.266805 -0.274193 -0.295953 -0.339422 -0.321428 -0.435120 -0.072823 -0.394465 -0.610233 -0.501126 -0.150390 -0.133249 -0.155661 0.338538 -0.364748 0.386028 -0.694705 -0.689612 -0.094825 -0.046864 0.162566 0.200364 0.292860 0.247094 0.290558 0.256777 0.211153 0.241556 0.215915 0.221718 0.220533 0.215180 0.269324 0.366238 0.394335 0.362103 0.339843 0.291790 0.317151
chargesum: 0.00000
title: Mulliken charges with hydrogens summed into heavy atoms:
elementType: O O O O O N N N N N C C C C C C C C C C C C
charge: -0.266805 -0.274193 -0.295953 -0.339422 -0.321428 -0.068882 -0.072823 -0.000130 0.091713 0.107815 0.142470 0.113844 0.134896 0.338538 0.103183 0.386028 -0.015517 0.015424 -0.094825 -0.046864 0.162566 0.200364
polarizability: 2.43008996e+02 -5.42518680e-01 2.04368366e+02 -1.43548356e+01 8.28353561e-01 1.12533677e+02
1716.lowfreq: -12.8344 -4.8637 -0.0008 -0.0005 0.0006 2.4972 25.8327 30.3606 48.2989
frequency: 24.7018 30.2410 48.2887 71.8058 78.2626 97.8029 106.2342 138.2981 153.6637 169.5020 174.7433 193.5811 221.8291 233.5127 259.0275 262.1987 274.9681 297.7484 306.7777 321.0214 339.9458 348.3241 376.3383 378.1270 392.7870 415.7821 482.7146 510.6680 551.3837 582.5242 591.6890 616.1906 629.7000 645.6655 654.9396 677.1652 702.7549 716.1718 722.6401 736.6148 776.2190 789.5796 803.9501 814.5064 823.4735 830.1388 843.6856 847.9342 887.6607 921.6833 929.5039 932.4681 959.7472 987.5207 999.0604 1008.6469 1017.0200 1046.8699 1057.3830 1075.8034 1079.1751 1140.0929 1142.3303 1167.9149 1181.1069 1188.6333 1205.7834 1227.0221 1246.1406 1252.0073 1259.6546 1261.8373 1277.6102 1292.4217 1318.2717 1331.4578 1334.6697 1345.7792 1353.5035 1379.9463 1393.5492 1431.6878 1452.2418 1455.2558 1458.6754 1466.9797 1474.2668 1484.7204 1520.9167 1546.9835 1549.7538 1578.5699 1627.3818 1659.8287 2964.1327 2990.6433 3006.2937 3061.4256 3069.7622 3076.5990 3093.5739 3099.6005 3107.3960 3108.7019 3115.8353 3120.4691 3368.5265 3505.3031 3505.7881 3571.3695 3670.6124
redmass: 4.4155 5.3597 6.2597 4.4843 5.4442 6.9776 3.9033 5.5049 5.5039 1.1010 6.1936 3.0720 2.8698 1.5342 3.4788 1.2325 3.8250 5.4262 5.9945 5.5571 2.7073 4.4842 4.7901 2.8854 3.6043 4.1766 3.9424 8.9285 1.5116 5.6374 4.0055 4.8731 5.1959 2.8255 1.2377 5.8629 5.7207 5.2544 8.6043 5.6607 4.3309 1.3521 2.2537 2.9880 3.4859 4.3643 3.1064 7.0281 2.9776 1.8575 1.2246 2.0456 2.3292 1.3086 4.5441 5.4479 3.1895 2.7269 4.0594 2.5184 1.9919 2.1494 2.4697 1.6091 3.0236 1.4846 2.6467 1.4439 1.5580 2.0951 3.2289 1.6239 2.9205 1.3963 1.2044 1.3191 1.4639 4.2562 2.3408 1.2787 1.2157 4.1185 1.0540 1.0802 1.0685 4.8718 1.0642 1.0482 5.5355 5.5623 2.8688 1.2834 1.9872 1.2687 1.0684 1.0351 1.0354 1.0878 1.0861 1.0970 1.0998 1.1013 1.0970 1.0993 1.0887 1.1009 1.0431 1.0468 1.0970 1.0818 1.1043
irintensity: 0.0679 0.3119 0.1973 0.0234 4.1353 7.6371 3.2142 11.4417 2.2301 0.4304 2.0609 49.3447 31.2531 48.9853 1.7289 0.5321 2.8205 0.8016 19.3710 6.3216 0.8479 28.5547 17.2940 2.2541 7.3633 2.8540 13.0638 24.9099 100.0184 2.3398 5.5336 0.5015 3.1145 118.3364 41.7721 2.9335 37.7842 16.6123 12.5023 23.0849 51.0615 31.7050 114.2066 221.5563 57.8089 85.3525 14.5592 14.6307 6.6370 5.5663 137.4179 53.1028 2.1606 1.1209 110.2928 51.5694 83.8302 27.6859 17.9983 29.3147 8.7368 23.3668 29.6168 13.2068 7.2921 19.8673 105.3384 15.9702 9.1334 99.5467 59.2565 11.3519 8.9380 9.0279 1.4770 3.6191 17.9459 9.8850 3.3164 40.4553 37.9492 117.1281 6.3953 1.3813 11.4176 114.3511 1.1777 10.4539 5.0422 273.2458 132.0422 288.8128 95.4458 40.7983 52.1820 19.5433 16.9816 24.0443 16.4082 615.3927 7.5094 7.3617 10.8704 29.8973 9.6778 20.2733 11.5110 61.4345 9.5058 129.5436 72.1965
temp: 298.150 k
press: 1.00000 atm
elementType: 8 8 8 8 8 7 7 7 7 7 6 6 6 6 6 6 6 6 6 6 6 6 1 1 1 1 1 1 1 1 1 1 1 1 1 1 1 1 1
symmnumber: 1
zpe: 797977.3 jmol-1
zpe.correction: 0.303934 hartree
zpe.thermalcorrener: 0.324670 hartree
zpe.thermalcorrenthalpy: 0.325615 hartree
zpe.thermalcorrgfe: 0.254050 hartree
zpe.sumelectzpe: -1115.675073 hartree
zpe.sumelectthermal: -1115.654336 hartree
zpe.sumelectthermalent: -1115.653392 hartree
zpe.sumelectthermalfe: -1115.724957 hartree
dipole: -0.4975 -4.5288 1.9250
dipole: 4.9461
quadrupole: -122.7429 -120.5524 -128.7494
quadrupole: 12.0050 -6.1552 4.4561
quadrupole: 1.2720 3.4625 -4.7345 12.0050 -6.1552 4.4561
hfenergy: -1115.9790066 hartree
pointgroup: C01 [X(C12H17N5O5)]
dipole: 0.3104876 -1.9163446 -0.1337958 debye
polarizability: 239.7333939|-4.2657968|192.6976132|-23.6109834|-30.7468153|127.4800318 unknown
InChI: InChI=1S/C12H17N5O5/c1-12(2)21-4-3-20-9(8(4)22-12)6-5(11(19)15-14)7(10(13)18)17-16-6/h4,8-9,15-16H,3,13-14H2,1-2H3
charge 0 multiplicity 1
39 atoms
O  -3.036044 1.054856 0.002892
O  -4.095674 -0.932406 -0.689377
O  -1.550894 -1.505692 1.309802
O  0.127964 2.302658 -0.459906
O  4.459079 0.750792 -1.131004
N  1.036933 -1.625086 0.83418
N  2.372207 -1.716082 0.539075
N  2.304751 2.346363 -1.266476
N  4.918508 -1.341056 -0.241631
N  2.174343 3.726417 -1.58296
C  -1.948978 0.160134 -0.41307
C  -2.655022 -1.17799 -0.830799
C  -1.014596 -0.216804 0.77382
C  -4.295799 0.28058 0.155708
C  -2.109091 -2.242682 0.141129
C  0.450976 -0.439238 0.437697
C  -5.430633 1.098005 -0.455316
C  -4.524865 -0.10764 1.624181
C  1.485557 0.324451 -0.159658
C  2.657687 -0.520411 -0.079388
C  1.259961 1.711447 -0.64763
C  4.064307 -0.307167 -0.526611
H  -1.399193 0.678763 -1.20856
H  -2.485306 -1.451767 -1.884821
H  -1.116846 0.543154 1.565473
H  -2.902359 -2.904758 0.519502
H  -1.310645 -2.841786 -0.344479
H  -5.195429 1.334715 -1.504956
H  -6.374135 0.52729 -0.415596
H  -5.560024 2.039833 0.104236
H  -4.645985 0.804697 2.234037
H  -5.441848 -0.716299 1.71258
H  -3.669481 -0.683991 2.014853
H  0.549297 -2.360442 1.348743
H  3.258319 1.911165 -1.298125
H  4.563444 -2.165916 0.244718
H  5.896051 -1.265796 -0.516776
H  2.260182 3.880533 -2.597033
H  1.262186 4.045351 -1.216455
