program: Gaussian 09
title: 000282547
version: EM64L-G09RevD.01
frameworkgroup: C1[X(C22H19N3O2S)]
method: RPBEPBE
basis: SDD
operation: Freq
keyword: #p
keyword: freq=noraman
keyword: PBEPBE/SDD
title: #p freq=noraman PBEPBE/SDD
converged: YES YES NO NO
title: Mulliken charges:
elementType: S O O N N N C C C C C C C C C C C C C C C C C C C C C C H H H H H H H H H H H H H H H H H H H
charge: 0.941900 -0.546279 -0.545414 -0.171720 -0.080646 -0.714950 0.287211 0.151494 -0.583076 0.283854 -0.342153 -0.352621 0.511011 -0.390228 -0.394086 -0.235775 -0.248033 -0.443412 -0.369379 0.275021 -0.212459 -0.221129 -0.239785 -0.058784 -0.334287 -0.357210 -0.235107 -0.214849 0.239126 0.246639 0.292036 0.235603 0.234945 0.220957 0.226903 0.227317 0.231925 0.249397 0.231290 0.231557 0.233696 0.253635 0.262018 0.283055 0.279060 0.327197 0.334534
chargesum: 0.00000
title: Mulliken charges with hydrogens summed into heavy atoms:
elementType: S O O N N N C C C C C C C C C C C C C C C C C C C C C C
charge: 0.941900 -0.546279 -0.545414 -0.171720 -0.080646 -0.053219 0.287211 0.151494 -0.097312 0.283854 -0.050117 -0.117017 0.511011 -0.155283 -0.173129 -0.008872 -0.020716 -0.211487 -0.119981 0.275021 0.018831 0.010428 -0.006089 -0.058784 -0.080652 -0.095193 0.047948 0.064212
polarizability: 5.01268996e+02 3.01415446e+01 3.24460875e+02 -8.76940821e+00 1.36274078e+01 1.93452355e+02
1716.lowfreq: -14.2525 -5.5673 -4.3809 -1.3992 -0.0010 0.0005 0.0012 8.2212 13.7267
frequency: -12.6380 6.8314 13.4869 21.7644 26.4548 35.4786 46.7812 73.6164 95.2247 105.2497 129.8053 137.3414 148.7287 175.8694 191.0282 210.5421 230.5821 234.3984 249.1807 262.2236 281.6701 299.6847 328.1180 341.3615 366.9332 400.1072 401.4095 414.5038 422.3711 424.0964 454.2862 456.3534 475.6799 523.2466 536.5096 559.2050 563.1949 571.1272 597.2403 614.7265 617.6766 629.3432 649.0485 695.0646 708.2099 730.0239 750.8151 751.8990 761.4594 766.3010 791.6176 794.8628 802.7304 813.6754 826.7485 840.1186 852.8987 853.9087 855.3776 866.0998 906.8299 909.6052 935.9347 960.6211 971.7103 973.6344 976.4483 977.7367 978.7236 988.6086 990.3202 999.9474 1016.0028 1018.5124 1027.6236 1049.6680 1068.4167 1081.7960 1101.5852 1111.4754 1130.3181 1162.7419 1170.0197 1173.7406 1175.1169 1191.3181 1195.7516 1207.2298 1221.9590 1257.7248 1285.3367 1309.9023 1317.3475 1346.8452 1351.7930 1364.8680 1376.6384 1387.3067 1398.6199 1408.0452 1416.5427 1442.7714 1458.3980 1462.2839 1473.3918 1481.6141 1487.6862 1532.2122 1542.9727 1570.3141 1575.9388 1585.9804 1596.6266 1612.6277 1615.4803 1626.4087 2953.7227 3006.3156 3056.8412 3116.8363 3125.5980 3129.3567 3136.5065 3137.5506 3141.3703 3149.2529 3149.9242 3154.9747 3161.7207 3166.5803 3167.1908 3175.4090 3235.5811 3358.9211 3526.8232
redmass: 5.1490 5.0844 4.0556 6.0086 4.7664 3.7154 5.9670 5.0427 1.7677 4.9710 6.8300 6.0826 4.8543 5.8151 5.0673 4.2820 4.5759 4.8072 3.4873 2.6840 6.6995 9.0841 2.5398 6.5802 5.4847 3.8981 3.3756 3.0463 3.9093 4.9538 5.2120 3.1779 4.2743 4.2711 3.9762 4.1131 4.5735 5.1779 5.5602 5.7088 6.5984 3.8892 4.9144 4.1624 1.7906 3.2398 2.1798 1.3558 3.8708 3.8800 5.5601 2.6761 3.8518 2.7276 1.4295 1.6144 1.3541 1.5167 1.3629 2.9908 4.1371 1.3801 1.3848 1.3523 1.6728 1.8913 1.3878 1.3640 1.3920 3.6123 6.1927 1.3391 2.3205 4.0934 2.3208 2.5014 1.4602 1.9831 2.4747 1.3136 1.5483 1.4638 1.1998 1.1071 1.0837 1.1164 2.0590 2.7036 2.1535 1.6354 1.2690 1.4553 1.7012 1.7487 1.6304 4.9394 3.1557 4.5688 2.5386 3.9674 4.8551 2.1778 2.7964 2.2776 1.5168 2.8704 1.8920 1.0873 5.9394 6.8152 7.2166 6.8671 6.0792 6.8022 6.0175 7.1192 1.0859 1.0594 1.1028 1.0881 1.0868 1.0852 1.0892 1.0909 1.0879 1.0959 1.0953 1.0885 1.0965 1.1015 1.1002 1.0973 1.0985 1.0414 1.0997
irintensity: 0.0614 1.0813 0.0513 0.6562 1.7522 4.7483 0.1779 1.9419 33.1555 0.3178 1.7000 0.3353 3.1471 4.6326 2.6221 5.5984 5.2872 9.3519 2.2316 2.9252 11.0744 3.3927 9.3340 1.8256 1.6574 6.0855 2.2096 1.4648 54.7538 70.1482 1.1245 9.2990 161.6434 26.9573 28.6569 24.1297 6.7379 35.8514 29.7126 0.9241 0.8792 3.9126 1.1954 19.4910 36.2904 2.3518 77.9801 98.9857 10.7496 2.9633 33.9319 21.9593 7.9980 245.2961 18.8592 29.4562 0.5356 24.9871 0.1107 63.2676 64.6592 2.0803 1.6476 0.5822 37.6772 11.1541 8.3321 4.7999 0.3247 1.2395 0.6847 1.0774 16.8327 25.8773 4.6667 64.2852 31.2954 4.3948 15.8109 3.3209 4.7782 305.4053 21.2083 7.5780 6.8690 0.7574 0.3039 17.5227 18.3638 24.0154 3.0119 39.0636 3.4336 34.8945 134.7873 0.6335 91.7711 8.1726 16.7186 6.6892 39.6512 24.5484 90.4414 66.8688 19.8276 49.9788 31.8243 10.1335 262.5515 149.1094 378.0267 64.5005 1.0942 226.5043 9.4889 118.2555 34.7558 36.6342 5.4334 8.3004 3.1828 1.9973 6.2237 7.1094 4.5945 40.0786 24.6108 0.8294 4.4780 25.8983 26.7475 4.1359 3.0928 25.2854 21.4523
temp: 298.150 k
press: 1.00000 atm
elementType: 16 8 8 7 7 7 6 6 6 6 6 6 6 6 6 6 6 6 6 6 6 6 6 6 6 6 6 6 1 1 1 1 1 1 1 1 1 1 1 1 1 1 1 1 1 1 1
symmnumber: 1
zpe: 937835.4 jmol-1
zpe.correction: 0.357203 hartree
zpe.thermalcorrener: 0.381697 hartree
zpe.thermalcorrenthalpy: 0.382642 hartree
zpe.thermalcorrgfe: 0.298037 hartree
zpe.sumelectzpe: -1560.372763 hartree
zpe.sumelectthermal: -1560.348269 hartree
zpe.sumelectthermalent: -1560.347324 hartree
zpe.sumelectthermalfe: -1560.431930 hartree
dipole: 8.7084 1.1965 2.1197
dipole: 9.0422
quadrupole: -185.9544 -158.1480 -167.4503
quadrupole: -16.3059 -28.0865 1.6793
quadrupole: -15.4368 12.3696 3.0672 -16.3059 -28.0865 1.6793
hfenergy: -1560.7299661 hartree
pointgroup: C01 [X(C22H19N3O2S1)]
dipole: -3.4423043 -0.583571 0.6823086 debye
polarizability: 500.509272|28.5558826|325.6932947|19.8715523|5.6606624|192.9796598 unknown
InChI: InChI=1S/C22H19N3O2S/c23-28(26,27)20-12-10-19(11-13-20)24-14-18-16-25(15-17-6-2-1-3-7-17)22-9-5-4-8-21(18)22/h1-14,16H,15,23H2
charge 0 multiplicity 1
47 atoms
S  7.296639 0.467228 0.246208
O  7.950019 -0.617271 -0.782024
O  7.717407 2.041428 0.272388
N  -2.99461 -0.34504 -0.996935
N  1.252688 0.186668 -0.315158
N  7.629487 -0.140193 1.960668
C  -3.073398 -1.708068 -0.629367
C  -1.75056 -2.132564 -0.258897
C  -4.121986 0.502927 -1.428497
C  -0.873792 -0.975992 -0.411499
C  -1.68301 0.084549 -0.858612
C  -4.184233 -2.57847 -0.597942
C  -4.583233 1.508926 -0.373798
C  -1.548378 -3.474946 0.151034
C  0.550673 -0.919097 -0.1648
C  -3.954857 -3.907916 -0.187686
C  -2.651689 -4.350571 0.182572
C  -4.881442 2.839878 -0.752896
C  -4.748535 1.12182 0.980029
C  2.656482 0.190371 -0.176634
C  -5.347092 3.771833 0.203023
C  -5.209391 2.052676 1.936124
C  -5.512889 3.379992 1.550443
C  5.435248 0.352313 0.08799
C  3.491657 -0.866499 -0.65507
C  3.262163 1.347166 0.397777
C  4.89183 -0.789366 -0.523285
C  4.657764 1.431738 0.546072
H  -4.952156 -0.173457 -1.701461
H  -3.831265 1.036871 -2.351711
H  -1.387073 1.109147 -1.073997
H  -5.191279 -2.24901 -0.874966
H  -0.554067 -3.831647 0.441207
H  1.023631 -1.86068 0.18665
H  -4.793116 -4.611962 -0.150967
H  -2.5107 -5.390064 0.49781
H  -4.747411 3.152302 -1.796376
H  -4.506415 0.097696 1.287741
H  -5.572075 4.799847 -0.10171
H  -5.330244 1.74513 2.98073
H  -5.869201 4.10149 2.293841
H  3.04201 -1.726511 -1.16313
H  2.612035 2.164413 0.723257
H  5.550572 -1.573975 -0.909519
H  5.135284 2.317303 0.976652
H  8.108441 -1.053792 1.887701
H  8.205271 0.579779 2.429822
