program: Gaussian 09
title: 000282476
version: EM64L-G09RevD.01
frameworkgroup: C1[X(C20H14S)]
method: RPBEPBE
basis: SDD
operation: Freq
keyword: #pfreq=noraman
keyword: PBEPBE/SDD
title: #p freq=noraman PBEPBE/SDD
converged: NO YES NO NO
title: Mulliken charges:
elementType: S C C C C C C C C C C C C C C C C C C C C H H H H H H H H H H H H H H
charge: 0.254049 0.423077 0.423076 -0.502578 -0.502578 0.366967 0.366967 -0.403162 -0.403162 -0.237326 -0.237325 -0.374883 -0.374893 -0.374904 -0.374892 -0.221720 -0.221722 -0.221723 -0.221722 -0.238348 -0.238348 0.246326 0.246326 0.223124 0.223124 0.249580 0.249582 0.249584 0.249581 0.229193 0.229196 0.229196 0.229195 0.230571 0.230571
chargesum: 0.00000
title: Mulliken charges with hydrogens summed into heavy atoms:
elementType: S C C C C C C C C C C C C C C C C C C C C
charge: 0.254049 0.423077 0.423076 -0.502578 -0.502578 0.366967 0.366967 -0.156835 -0.156836 -0.014202 -0.014202 -0.125303 -0.125311 -0.125320 -0.125311 0.007474 0.007474 0.007473 0.007473 -0.007777 -0.007777
polarizability: 3.40159689e+02 1.40813686e-04 2.07287614e+02 -9.16795766e-03 5.01308944e-02 1.68319301e+02
1716.lowfreq: -51.5827 -41.8417 -7.2643 -3.9563 -1.7559 -0.0016 -0.0012 0.0018 34.6754
frequency: -51.5827 -41.7951 34.4200 45.2770 72.5247 78.9483 162.5771 170.8549 204.9588 210.1846 240.3349 260.2878 311.6204 399.1593 399.2037 416.7290 429.9126 434.3527 455.2724 500.6396 518.2637 557.2423 570.8719 584.8440 617.0132 619.1369 621.6870 658.0852 682.9093 702.9713 704.0549 750.8235 754.6651 763.0094 766.7419 851.5898 854.7093 860.1283 881.4745 889.7254 917.2334 920.4408 937.1499 945.1629 960.1500 978.4267 978.8916 985.3038 987.9413 988.2547 997.9165 998.1048 1000.6505 1025.8404 1027.8284 1073.8185 1074.6143 1115.4965 1164.7203 1171.9664 1171.9768 1183.9413 1184.6082 1198.9047 1234.2719 1277.3170 1304.5228 1305.8826 1365.1114 1365.5120 1366.0242 1381.2934 1426.6674 1427.5494 1438.8678 1469.7331 1471.6251 1507.9911 1529.3201 1530.9031 1579.2501 1580.0392 1607.6238 1609.5269 1622.5340 3123.7585 3124.5160 3124.5361 3131.8935 3131.9169 3134.8837 3144.1886 3144.2482 3149.9813 3152.6484 3152.7208 3162.4066 3165.9557 3166.1184
redmass: 4.3230 3.7042 5.7656 5.6557 5.2544 4.4847 6.7897 3.9701 4.6433 6.1143 4.8749 5.4782 8.1250 2.8287 2.8255 4.8474 3.0872 5.6108 11.0301 3.6194 4.4502 4.1180 5.6256 6.4900 6.4218 7.1503 6.4409 6.4308 6.1147 1.8723 1.6820 4.3694 1.7857 1.3598 2.0448 1.3095 1.2417 1.4233 3.9304 3.1274 3.9586 6.4446 1.6752 2.2751 1.3380 1.3838 1.3848 1.3013 6.2912 6.2822 1.3695 1.3173 2.0683 2.1478 2.0480 1.6055 1.5995 2.0592 1.1251 1.0545 1.0545 1.1099 1.1108 1.7306 3.6410 2.0167 1.3885 1.3803 2.5229 6.4097 6.6904 2.0844 2.2046 2.2038 3.9265 2.6445 2.4456 6.1417 6.0871 6.5116 5.8983 5.9337 6.1915 6.2929 6.6592 1.0847 1.0846 1.0846 1.0879 1.0879 1.0879 1.0927 1.0927 1.0962 1.0970 1.0970 1.1006 1.1018 1.1018
irintensity: 0.0086 0.0000 0.6550 0.6078 0.1608 0.0000 1.5526 0.0000 0.0815 0.0544 0.4698 0.0170 0.9008 0.0000 0.0280 1.4750 10.0534 0.0000 1.4385 12.0484 3.4905 0.0000 0.0301 0.3585 0.0000 8.9786 0.3194 7.2660 21.6390 84.7252 9.8090 0.0006 102.4251 82.4733 2.3823 0.0000 0.0389 0.0000 8.7973 0.4470 1.2391 13.6937 1.6739 0.1058 0.0588 0.0000 0.0000 0.0000 6.0412 0.4603 0.3675 0.0588 8.6500 17.9262 2.2026 0.0000 20.6209 0.0888 3.2336 0.0000 0.0003 6.7401 1.1653 0.7861 2.3723 6.2780 0.0000 0.5700 19.8897 0.0049 0.4550 27.9019 0.0000 15.6408 0.3975 3.6232 18.7885 1.1330 2.5142 0.8673 0.0000 3.3144 8.3529 1.2145 0.1546 1.6856 2.7867 0.3527 0.0107 3.5624 5.1259 39.9339 3.0110 26.6206 0.0051 63.7574 35.1967 48.9778 2.8679
temp: 298.150 k
press: 1.00000 atm
elementType: 16 6 6 6 6 6 6 6 6 6 6 6 6 6 6 6 6 6 6 6 6 1 1 1 1 1 1 1 1 1 1 1 1 1 1
symmnumber: 1
zpe: 708415.9 jmol-1
zpe.correction: 0.269821 hartree
zpe.thermalcorrener: 0.284866 hartree
zpe.thermalcorrenthalpy: 0.285810 hartree
zpe.thermalcorrgfe: 0.226603 hartree
zpe.sumelectzpe: -1167.173492 hartree
zpe.sumelectthermal: -1167.158447 hartree
zpe.sumelectthermalent: -1167.157503 hartree
zpe.sumelectthermalfe: -1167.216710 hartree
dipole: 0.0000 0.0938 0.0001
dipole: 0.0938
quadrupole: -104.3890 -129.2382 -121.2559
quadrupole: 0.0000 -0.0027 0.0167
quadrupole: 13.9054 -10.9439 -2.9615 0.0000 -0.0027 0.0167
hfenergy: -1167.4433132 hartree
pointgroup: C01 [X(C20H14S1)]
dipole: -0.0000008 -0.0368987 -0.0000554 debye
polarizability: 340.1596891|-0.0053723|207.2875788|0.0049284|0.0624042|168.3193364 unknown
InChI: InChI=1S/C20H14S/c1-3-9-15(10-4-1)19-17-13-7-8-14-18(17)20(21-19)16-11-5-2-6-12-16/h1-14H
charge 0 multiplicity 1
35 atoms
S  0.000031 1.504635 0.000271
C  -0.734502 -1.031662 0.000184
C  0.734368 -1.031718 0.000121
C  -1.299145 0.255034 0.00028
C  1.29911 0.254934 0.000161
C  -2.731823 0.645559 0.000283
C  2.731818 0.645348 0.000064
C  -1.442726 -2.288912 0.000181
C  1.442495 -2.289023 0.000033
C  -0.723322 -3.478122 0.000098
C  0.722999 -3.478177 0.000017
C  -3.432314 0.829411 1.223502
C  3.432709 0.827227 -1.223222
C  -3.433204 0.825839 -1.222959
C  3.43283 0.827488 1.223241
C  -4.800126 1.183273 1.223277
C  4.800551 1.18097 -1.223128
C  -4.801019 1.179685 -1.222779
C  4.800672 1.181233 1.222932
C  -5.48818 1.359933 0.000238
C  5.488234 1.359499 -0.000151
H  -2.538071 -2.288735 0.000258
H  2.53784 -2.288931 -0.000015
H  -1.251596 -4.438464 0.000101
H  1.251199 -4.43856 -0.000047
H  -2.897024 0.691366 2.169466
H  2.897692 0.687769 -2.169133
H  -2.898581 0.685078 -2.168899
H  2.897911 0.688227 2.169237
H  -5.326783 1.321073 2.174296
H  5.327512 1.317244 -2.174197
H  -5.328359 1.314722 -2.173816
H  5.32773 1.31771 2.173919
H  -6.548602 1.636434 0.000221
H  6.548678 1.635915 -0.000233
