program: Gaussian 09
title: 000282478
version: EM64L-G09RevD.01
frameworkgroup: C1[X(C21H20O3)]
method: RPBEPBE
basis: SDD
operation: Freq
keyword: #pfreq=noraman
keyword: PBEPBE/SDD
title: #p freq=noraman PBEPBE/SDD
converged: YES YES NO NO
title: Mulliken charges:
elementType: O O O C C C C C C C C C C C C C C C C C C C C C H H H H H H H H H H H H H H H H H H H H
charge: -0.194954 -0.155034 -0.153661 -0.269868 -0.302732 -0.333705 -0.218734 0.123426 -0.096586 0.262323 -0.607814 -0.489800 0.135345 0.150360 0.174822 -0.611688 0.267987 -0.737900 -0.214966 -0.198178 -0.369558 -0.380362 -0.269885 -0.254508 0.247054 0.270071 0.278582 0.268004 0.242052 0.227113 0.230306 0.217214 0.227761 0.259697 0.227632 0.240654 0.215466 0.216733 0.211996 0.212269 0.257034 0.235067 0.230993 0.229974
chargesum: 0.00000
title: Mulliken charges with hydrogens summed into heavy atoms:
elementType: O O O C C C C C C C C C C C C C C C C C C C C C
charge: -0.194954 -0.155034 -0.153661 -0.022814 -0.032660 -0.055123 0.049270 0.123426 0.145465 0.262323 -0.150395 -0.044824 0.135345 0.150360 0.174822 -0.124359 0.267987 -0.065047 -0.002970 0.014091 -0.112524 -0.145295 -0.038891 -0.024535
polarizability: 2.58937266e+02 -1.38015606e+01 2.35704593e+02 2.06126213e+01 2.19312888e+01 1.76751173e+02
1716.lowfreq: -9.8287 -0.0005 0.0004 0.0005 6.4317 14.0039 33.4452 45.0790 62.0483
frequency: 33.3948 45.0051 62.0265 74.5608 86.9114 116.5263 130.9218 138.5052 171.8104 183.7440 201.1907 217.8648 254.2708 271.0568 283.8775 314.7295 335.5814 359.7055 374.5110 382.6248 402.7788 410.2679 432.0625 460.7808 479.8992 500.9410 522.6076 561.1863 568.4162 595.4272 600.4368 612.7492 635.4960 660.3073 673.5690 680.8109 729.4664 731.3046 745.6278 769.9425 781.1016 807.6982 810.2505 821.6788 849.7640 873.1736 897.9650 902.3043 913.2697 929.1650 934.5046 952.4022 960.0470 970.6464 981.6786 989.0443 992.6968 1014.3288 1031.0369 1053.4140 1063.0872 1074.6930 1079.8825 1104.8323 1113.3578 1117.5568 1140.7765 1148.4293 1162.2031 1166.2603 1175.6192 1179.6484 1187.7726 1211.8069 1217.2217 1226.7980 1245.3238 1250.1910 1264.0826 1277.2634 1287.3733 1292.8644 1301.4406 1311.8020 1318.9116 1321.6389 1327.6398 1341.9072 1364.8687 1373.7936 1376.2284 1379.1883 1400.2898 1439.8148 1450.4508 1452.9363 1453.7355 1468.6114 1482.6971 1487.0147 1579.9769 1608.8169 1659.9938 1678.0290 1700.2035 1768.9257 2932.4922 2945.7797 2947.7641 2953.9008 2954.7019 2960.2415 2970.3022 2981.8836 3001.8770 3013.8524 3034.0973 3070.6521 3075.0906 3085.0750 3100.8063 3114.2048 3131.2634 3132.1276 3147.8789 3163.7753
redmass: 5.9317 6.4587 4.4897 2.8757 4.0389 3.6014 5.8147 11.2751 3.2680 2.7547 3.8218 1.2904 3.6860 3.4153 3.5491 4.4417 3.4420 4.8179 3.8901 2.5791 5.7884 2.9966 3.9626 3.1265 4.7628 3.9309 4.3106 3.9811 7.4497 5.8264 7.5922 5.2901 4.4507 2.3259 2.6744 2.8295 4.9380 2.3755 4.3711 1.6565 4.3099 6.9000 4.2306 5.4812 2.7066 1.3712 2.2439 3.5438 2.4225 2.2238 1.9446 1.7799 1.4027 1.2614 2.6138 1.3844 2.4597 3.0524 3.1572 2.3214 2.2642 2.4022 2.7040 5.8593 2.6205 2.1720 1.9862 1.7724 1.4401 1.1890 1.0817 1.2457 1.2461 1.9860 1.4040 1.4521 1.6360 1.5416 1.3304 1.7850 1.3580 1.9625 1.4092 1.4756 1.5181 1.3970 1.5254 1.7808 1.3746 1.6797 1.7346 3.9539 1.2019 2.4201 1.1316 1.0957 1.0979 1.0705 2.0791 1.1005 6.5943 6.2978 8.8980 6.4908 12.6675 12.6913 1.0694 1.0656 1.0801 1.0761 1.0693 1.0790 1.0837 1.0367 1.0987 1.0970 1.0883 1.0976 1.0875 1.0984 1.0842 1.0876 1.0878 1.0996 1.0934 1.1002
irintensity: 0.8314 1.0879 0.1879 0.3265 0.6637 0.2520 4.3881 0.7211 0.3681 2.2236 1.7144 0.0961 0.5094 2.8717 4.7701 1.3284 1.1961 2.4101 1.9177 0.9532 8.1414 5.3223 2.5610 1.4031 0.8439 3.1706 2.9031 5.7360 1.9330 12.3071 2.0693 13.5686 2.4595 12.8317 48.1055 11.9802 0.5105 14.5924 31.6781 53.7192 36.6126 139.5988 35.1881 10.7696 10.6947 0.7640 0.4729 7.1281 7.2177 7.0016 17.2436 2.2188 2.6484 1.1281 14.2422 4.7794 38.6812 28.2922 13.0114 11.0457 4.9330 14.4097 9.2608 130.9312 23.1217 8.1844 4.6682 0.6708 3.1505 2.6965 0.3338 1.0867 1.8951 3.7160 2.9647 3.2507 2.4977 1.9151 2.5398 3.2596 5.4608 1.9778 0.5463 1.3856 6.4007 5.7130 3.2653 0.4939 1.0296 2.7988 4.8898 1.0346 17.0266 4.6257 13.3318 10.3736 6.4516 12.2966 11.4734 22.3264 1.1359 1.2303 4.2033 8.2365 432.7172 112.7542 20.8462 22.2824 4.7794 22.6960 16.8206 13.5408 35.5751 27.7362 43.0191 24.2675 8.9242 31.3654 5.8446 35.5793 5.3589 11.1770 4.9994 66.0394 27.5835 26.6393
temp: 298.150 k
press: 1.00000 atm
elementType: 8 8 8 6 6 6 6 6 6 6 6 6 6 6 6 6 6 6 6 6 6 6 6 6 1 1 1 1 1 1 1 1 1 1 1 1 1 1 1 1 1 1 1 1
symmnumber: 1
zpe: 933283.4 jmol-1
zpe.correction: 0.355469 hartree
zpe.thermalcorrener: 0.375019 hartree
zpe.thermalcorrenthalpy: 0.375964 hartree
zpe.thermalcorrgfe: 0.307921 hartree
zpe.sumelectzpe: -1036.190102 hartree
zpe.sumelectthermal: -1036.170551 hartree
zpe.sumelectthermalent: -1036.169607 hartree
zpe.sumelectthermalfe: -1036.237649 hartree
dipole: 2.5679 2.4364 -4.5771
dipole: 5.7862
quadrupole: -137.5265 -144.9605 -147.3190
quadrupole: -10.2933 15.3414 4.8167
quadrupole: 5.7422 -1.6918 -4.0503 -10.2933 15.3414 4.8167
hfenergy: -1036.5455704 hartree
pointgroup: C01 [X(C21H20O3)]
dipole: -1.0185367 -1.0220362 -1.7607569 debye
polarizability: 258.6976121|-14.8285839|234.08468|-20.2228989|-24.0752562|178.6107395 unknown
InChI: InChI=1S/C21H20O3/c1-11-10-12-6-2-3-7-13(12)17-14-8-4-5-9-15(14)18-19(16(11)17)21(23)24-20(18)22/h2-7,11,15-16,18-19H,8-10H2,1H3
charge 0 multiplicity 1
44 atoms
O  2.829612 1.537302 1.628635
O  2.586625 3.31491 0.130836
O  2.877483 -0.619519 2.541448
C  0.231907 1.093149 -0.300334
C  1.792171 1.006389 -0.48713
C  2.44294 -0.2730 0.088221
C  1.68479 -1.587759 -0.116312
C  -0.453757 -0.229584 0.075702
C  -0.476595 1.631243 -1.596617
C  0.179945 -1.445871 0.056085
C  -1.966899 1.925633 -1.286171
C  2.013497 -2.251136 -1.484743
C  -1.909916 -0.056171 0.354336
C  2.433513 2.112207 0.354942
C  2.711553 0.093189 1.551196
C  -0.516187 -2.801279 0.092881
C  -2.643264 0.96891 -0.31346
C  0.16617 2.906235 -2.190771
C  1.168476 -3.493807 -1.68989
C  0.056378 -3.75081 -0.954391
C  -2.57948 -0.840249 1.337851
C  -4.02219 1.134349 -0.034384
C  -3.9484 -0.660643 1.614021
C  -4.682816 0.323964 0.911259
H  0.014421 1.827767 0.504574
H  2.051465 1.152095 -1.546736
H  3.454826 -0.373525 -0.362754
H  2.034779 -2.294843 0.666297
H  -0.420582 0.815323 -2.348078
H  -2.031348 2.949538 -0.859981
H  -2.53404 1.962371 -2.237042
H  3.08929 -2.519953 -1.516629
H  1.846702 -1.530211 -2.313887
H  -1.601128 -2.690255 -0.083512
H  -0.418578 -3.274679 1.095477
H  0.254537 3.702406 -1.429346
H  1.175135 2.734153 -2.603933
H  -0.462989 3.289443 -3.015982
H  1.495641 -4.209901 -2.455411
H  -0.502231 -4.682481 -1.117796
H  -2.00499 -1.566456 1.921577
H  -4.580202 1.918597 -0.561709
H  -4.436468 -1.272477 2.380518
H  -5.749394 0.470138 1.114344
