program: Gaussian 09
title: 000282467
version: EM64L-G09RevD.01
frameworkgroup: C1[X(C19H22O2)]
method: RPBEPBE
basis: SDD
operation: Freq
keyword: #pfreq=noraman
keyword: PBEPBE/SDD
title: #p freq=noraman PBEPBE/SDD
converged: YES YES NO NO
title: Mulliken charges:
elementType: O O C C C C C C C C C C C C C C C C C C C H H H H H H H H H H H H H H H H H H H H H H
charge: -0.250900 -0.246553 0.369167 -0.511267 -0.457754 -0.454832 -0.449904 -0.437258 -0.459982 0.156680 0.391257 -0.729921 -0.580536 -0.389297 0.368693 -0.431748 0.376300 -0.424083 -0.407157 -0.244274 -0.242288 0.204125 0.225179 0.245580 0.204537 0.212761 0.227030 0.225001 0.212430 0.208489 0.237754 0.227511 0.212209 0.229178 0.244056 0.228462 0.273450 0.266349 0.236135 0.241437 0.238312 0.227989 0.227687
chargesum: 0.00000
title: Mulliken charges with hydrogens summed into heavy atoms:
elementType: O O C C C C C C C C C C C C C C C C C C C
charge: -0.250900 -0.246553 0.369167 -0.081964 -0.007637 -0.015041 -0.012473 0.008985 -0.020261 0.156680 0.391257 -0.028226 -0.307087 -0.122948 0.368693 -0.195612 0.376300 -0.182647 -0.168845 -0.016286 -0.014601
polarizability: 2.75489052e+02 -3.33166550e+01 1.79095080e+02 8.43154958e+00 2.01583859e+01 1.73179004e+02
1716.lowfreq: -17.6471 -0.0002 0.0005 0.0006 4.1818 5.9730 22.6012 34.9666 45.0243
frequency: -13.3999 34.6732 44.1823 74.1630 90.8168 125.6060 143.2387 183.1221 189.2926 199.4386 213.3793 248.1719 286.7834 287.3361 316.0169 356.9367 362.8948 394.8991 401.6304 429.3119 480.6135 483.4106 490.6960 512.1296 517.8469 544.5688 580.1509 610.6383 631.1204 644.1626 652.4433 682.9199 746.6742 757.9088 759.3192 790.0909 793.1940 800.7071 811.4918 814.9155 841.7826 879.7821 880.8240 883.3768 911.9781 934.2040 938.2743 942.7087 946.8306 954.5400 965.2998 972.9070 989.8326 993.9394 1001.0400 1022.1377 1042.4501 1054.0361 1061.3140 1071.2604 1105.3720 1122.8711 1128.4343 1140.6272 1156.5498 1165.8288 1172.1785 1190.4459 1197.3859 1211.1151 1218.5365 1227.9564 1236.9223 1252.7832 1261.3843 1273.2704 1277.5672 1285.6934 1304.2116 1326.1882 1331.9975 1334.5319 1345.9974 1364.2211 1385.2164 1407.5814 1422.5373 1431.6642 1452.9508 1456.6386 1460.2087 1461.6052 1463.6042 1466.7100 1471.6187 1476.6378 1493.6223 1511.6355 1580.8762 1603.1235 1639.8172 2948.3954 2959.7770 2973.8884 2990.8962 2995.4910 3009.0175 3011.2843 3034.7913 3047.7098 3063.2700 3068.1310 3072.2574 3082.2102 3116.9994 3118.5832 3118.9924 3121.8119 3124.4404 3131.4456 3141.8416 3151.9544 3161.2992
redmass: 1.7062 4.7457 3.9256 3.1140 3.8137 3.0956 4.2278 3.3941 3.7984 1.0355 3.3652 2.3397 3.8486 3.6596 5.3724 3.6662 2.9237 2.3428 2.1745 3.1131 4.9288 2.6101 4.6661 6.8719 3.7251 6.0130 3.6420 6.0786 2.9389 5.6865 2.9434 2.8753 1.7484 4.4468 1.3438 2.9548 3.5642 2.1699 1.7491 2.4956 1.3330 3.4693 1.5926 2.5950 2.2261 1.7387 1.5066 3.6872 5.0063 2.2321 1.4061 2.3052 1.3394 1.3628 3.5472 2.2766 1.6162 1.6911 2.5393 1.8979 1.8845 2.3919 1.7655 2.5570 1.2560 1.9089 1.0872 1.3949 1.4667 1.6256 1.4778 1.1759 2.0327 1.4562 2.0946 1.8544 1.2826 1.3854 1.4203 1.5709 1.7224 1.2816 1.7874 1.3317 1.2409 5.3557 3.0470 4.0187 1.1964 1.0754 1.0743 1.0752 1.9027 1.0883 1.0829 1.0829 1.0951 3.6987 7.5240 5.6671 6.9137 1.0657 1.0660 1.0615 1.0645 1.0625 1.0347 1.0667 1.0971 1.1022 1.0974 1.1009 1.0979 1.1020 1.1004 1.1008 1.0857 1.0882 1.0888 1.0907 1.0949 1.0958 1.1003
irintensity: 0.0050 0.2647 0.0540 0.0293 0.1623 0.4383 1.6100 0.0455 1.1603 0.0979 1.6491 0.2215 4.9136 0.4666 13.2399 0.7795 0.1549 0.5169 4.0194 2.7644 2.0636 21.0856 6.3123 0.1096 5.8977 11.0479 3.8472 1.1836 0.4901 1.3990 1.1767 2.9603 7.8180 2.3224 56.2465 10.3429 16.3540 9.2524 1.7366 24.1605 42.2720 2.2966 25.0342 2.7218 14.2491 3.4599 3.3449 13.6735 15.6774 7.5207 9.6081 20.7430 1.1300 1.7635 93.7450 5.5482 2.3595 21.4722 2.4438 12.6340 29.2521 28.5139 51.4030 99.6958 0.9504 62.1424 2.2237 24.2967 15.5806 10.4932 6.1314 2.5439 2.9549 1.0709 20.1635 17.7197 0.0786 1.3389 1.5908 1.5819 1.7241 0.7060 8.0753 4.1141 31.3948 0.7411 0.5599 0.9637 1.7621 8.9155 8.1519 3.7356 0.1802 10.0209 10.3338 5.4757 10.1433 12.7876 0.0151 4.7518 0.7413 26.6377 48.4422 43.5585 24.5708 34.8724 12.0537 55.9995 31.0961 0.4519 25.5270 53.4082 26.3417 72.2706 16.3392 23.8959 2.3431 8.2307 1.6550 2.0358 33.2508 11.8352 37.2396
temp: 298.150 k
press: 1.00000 atm
elementType: 8 8 6 6 6 6 6 6 6 6 6 6 6 6 6 6 6 6 6 6 6 1 1 1 1 1 1 1 1 1 1 1 1 1 1 1 1 1 1 1 1 1 1
symmnumber: 1
zpe: 951258.6 jmol-1
zpe.correction: 0.362315 hartree
zpe.thermalcorrener: 0.379557 hartree
zpe.thermalcorrenthalpy: 0.380502 hartree
zpe.thermalcorrgfe: 0.317654 hartree
zpe.sumelectzpe: -886.129089 hartree
zpe.sumelectthermal: -886.111847 hartree
zpe.sumelectthermalent: -886.110903 hartree
zpe.sumelectthermalfe: -886.173751 hartree
dipole: 0.1357 -1.8227 1.1682
dipole: 2.1691
quadrupole: -115.0891 -125.2417 -121.0112
quadrupole: 1.0865 -0.4434 4.2343
quadrupole: 5.3582 -4.7944 -0.5638 1.0865 -0.4434 4.2343
hfenergy: -886.4914044 hartree
pointgroup: C01 [X(C19H22O2)]
dipole: 0.0481589 -0.6843542 0.5075822 debye
polarizability: 275.2508565|-32.8832819|181.8027127|11.7256159|19.2421122|170.7095669 unknown
InChI: InChI=1S/C19H22O2/c1-18(20-13-19(14-21-18)10-4-5-11-19)17-9-8-15-6-2-3-7-16(15)12-17/h2-3,6-9,12H,4-5,10-11,13-14H2,1H3
charge 0 multiplicity 1
43 atoms
O  -1.487722 0.366076 -1.521381
O  -1.68759 1.854089 0.384719
C  -2.910903 -0.320717 0.416668
C  -3.361431 -1.525752 1.288551
C  -4.255657 0.202437 -0.161252
C  -4.512742 -2.199026 0.486351
C  -5.123797 -1.068047 -0.41116
C  -1.956235 -0.782338 -0.712746
C  -2.143885 0.733734 1.23876
C  -0.82127 1.41009 -0.72154
C  0.547416 0.929676 -0.198088
C  -0.690393 2.618073 -1.651589
C  1.286952 -0.029123 -0.896295
C  1.115444 1.546343 0.966889
C  2.594244 -0.422818 -0.460284
C  2.386637 1.186812 1.413989
C  3.159743 0.196208 0.721887
C  3.362826 -1.412573 -1.159498
C  4.46817 -0.197789 1.157237
C  4.634733 -1.777457 -0.712025
C  5.192539 -1.165049 0.456414
H  -3.744051 -1.142155 2.256179
H  -2.534603 -2.22391 1.518897
H  -4.101551 0.803663 -1.073066
H  -4.739158 0.859375 0.587787
H  -5.264791 -2.646957 1.159985
H  -4.117677 -3.02024 -0.139629
H  -5.094368 -1.361361 -1.47648
H  -6.183985 -0.879526 -0.165067
H  -1.087629 -1.320972 -0.277551
H  -2.461548 -1.4393 -1.439638
H  -2.793824 1.206859 1.994627
H  -1.271154 0.270173 1.748229
H  -0.086307 2.349757 -2.533521
H  -1.695604 2.930963 -1.977695
H  -0.203194 3.453347 -1.122474
H  0.857426 -0.486257 -1.795931
H  0.525117 2.302121 1.496478
H  2.812041 1.663281 2.305572
H  2.935267 -1.880541 -2.05448
H  4.893743 0.273626 2.051444
H  5.213161 -2.534419 -1.253104
H  6.191613 -1.459675 0.796234
