program: Gaussian 09
title: 000282459
version: EM64L-G09RevD.01
frameworkgroup: C1[X(C18H11FO3)]
method: RPBEPBE
basis: SDD
operation: Freq
keyword: #p
keyword: freq=noraman
keyword: PBEPBE/SDD
title: #p freq=noraman PBEPBE/SDD
converged: YES YES NO NO
title: Mulliken charges:
elementType: F O O O C C C C C C C C C C C C C C C C C C H H H H H H H H H H H
charge: -0.181228 -0.182842 -0.438338 -0.227927 0.380829 0.396487 0.375887 -0.519181 0.017125 0.024618 -0.393669 -0.418178 -0.422467 0.159178 -0.405216 0.246822 -0.244126 -0.236786 -0.355013 -0.381405 -0.182792 0.095654 0.246362 0.275753 0.240216 0.241694 0.242214 0.231459 0.230964 0.284596 0.265659 0.242740 0.390913
chargesum: 0.00000
title: Mulliken charges with hydrogens summed into heavy atoms:
elementType: F O O O C C C C C C C C C C C C C C C C C C
charge: -0.181228 -0.182842 -0.047425 -0.227927 0.380829 0.396487 0.375887 -0.272819 0.017125 0.024618 -0.117917 -0.177962 -0.180773 0.159178 -0.163002 0.246822 -0.012668 -0.005822 -0.070417 -0.115747 0.059948 0.095654
polarizability: 2.89788024e+02 7.50164285e+00 1.71821364e+02 -5.80429900e+00 2.54246167e+01 1.80995110e+02
1716.lowfreq: -3.6478 -0.0003 0.0005 0.0007 3.3227 9.2092 18.1131 28.1776 45.7639
frequency: 18.0199 28.1586 45.7548 66.2167 86.8087 97.3993 135.0338 173.0486 182.5551 186.5657 215.5104 242.9095 257.5191 325.8447 342.9771 360.9598 391.0011 413.7999 431.6771 471.6732 477.1479 493.3186 501.7725 510.8416 553.7423 567.6072 594.6147 604.0601 617.6668 629.1767 639.5497 706.7061 717.4025 725.2024 758.6832 762.8963 768.7642 789.4081 821.7949 842.4530 845.5470 879.3542 893.4774 908.6448 923.7037 927.6541 960.6911 968.5703 990.5891 993.8537 1002.7680 1023.5148 1044.0028 1070.3675 1117.5810 1141.1924 1154.5415 1169.1655 1174.1304 1187.6872 1216.6220 1218.8925 1241.6865 1275.6412 1288.1422 1323.8824 1348.7506 1378.4270 1413.3099 1425.7024 1433.8665 1436.3689 1452.9708 1464.8169 1510.2287 1562.5694 1574.3845 1585.0479 1603.7598 1606.4304 1637.5005 1641.0240 3122.0768 3125.4153 3127.3872 3130.6004 3144.8033 3155.8545 3163.7861 3165.7086 3176.7908 3189.8140 3532.5101
redmass: 8.3468 4.6369 6.4654 8.1240 8.0035 7.0614 11.2070 7.7901 5.5501 3.9498 6.0556 6.2971 6.5212 8.9851 7.9564 5.3446 3.1092 5.5817 6.5437 4.9362 2.7169 4.2235 4.0713 6.8471 6.3891 3.4626 5.3730 1.6538 3.5121 3.8175 6.0760 6.4070 2.8932 4.8478 4.5485 2.1979 1.5862 2.6486 2.3257 6.0348 1.3249 2.3263 3.0457 5.9647 1.4037 1.7082 4.0926 1.4168 1.3428 1.3417 1.3659 2.2742 2.8793 2.3078 1.8958 2.0533 1.2062 1.3203 1.0808 1.8329 1.9209 2.0948 1.6942 1.8155 3.3431 2.5860 1.8358 10.7129 6.0185 2.7561 3.1587 3.7302 3.1772 2.7095 3.7861 10.0680 7.4536 8.0526 5.6513 7.7903 6.8980 8.7801 1.0863 1.0907 1.0892 1.0889 1.0949 1.0880 1.1003 1.0959 1.0939 1.0979 1.0643
irintensity: 0.9448 0.6502 1.8195 0.0099 0.1408 0.5991 0.3104 2.4595 1.8130 2.1959 1.1726 5.3991 1.4561 7.6793 5.0956 3.3864 0.2492 11.9673 7.5781 1.1697 20.6707 3.2901 4.0185 0.1036 11.3866 27.7450 52.5853 87.5677 33.4364 1.6804 8.7240 10.2203 13.2957 33.6229 4.1236 41.0433 80.8472 3.9693 19.8455 22.4700 19.0976 10.5930 94.0539 47.6882 1.0444 17.6603 12.2865 10.7701 1.4037 0.0047 0.0186 5.5057 162.4883 76.1127 28.4206 28.6639 7.6344 28.7508 0.7899 80.3972 55.0097 54.2032 19.4856 3.8100 193.2648 114.4397 21.3615 7.6961 11.6892 2.2061 39.0663 9.1863 16.1436 29.8424 6.1755 228.4304 22.0002 44.2324 11.5588 57.3462 46.9372 200.3171 1.4129 12.5274 2.4176 6.0057 29.6751 6.5275 34.2139 9.7803 1.4044 4.8853 58.6339
temp: 298.150 k
press: 1.00000 atm
elementType: 9 8 8 8 6 6 6 6 6 6 6 6 6 6 6 6 6 6 6 6 6 6 1 1 1 1 1 1 1 1 1 1 1
symmnumber: 1
zpe: 625695.1 jmol-1
zpe.correction: 0.238315 hartree
zpe.thermalcorrener: 0.256020 hartree
zpe.thermalcorrenthalpy: 0.256964 hartree
zpe.thermalcorrgfe: 0.190777 hartree
zpe.sumelectzpe: -1016.551757 hartree
zpe.sumelectthermal: -1016.534051 hartree
zpe.sumelectthermalent: -1016.533107 hartree
zpe.sumelectthermalfe: -1016.599295 hartree
dipole: 0.1613 -1.4863 -4.6273
dipole: 4.8629
quadrupole: -99.9454 -119.1512 -125.6552
quadrupole: 5.3800 10.2268 1.4474
quadrupole: 14.9718 -4.2340 -10.7379 5.3800 10.2268 1.4474
hfenergy: -1016.7900714 hartree
pointgroup: C01 [X(C18H11F1O3)]
dipole: -0.1273597 1.366435 -1.3330259 debye
polarizability: 290.2488727|3.6392585|194.8495724|3.0919787|-18.2637803|157.506052 unknown
InChI: InChI=1S/C18H11FO3/c19-15-7-3-6-14(18(21)22)16(15)17(20)13-9-8-11-4-1-2-5-12(11)10-13/h1-10,21H
charge 0 multiplicity 1
33 atoms
F  1.590166 1.238422 2.481326
O  1.386047 -1.984705 1.555217
O  3.127259 -1.1722 -2.894267
O  1.338741 -1.952593 -1.638415
C  -2.413402 0.537502 -0.191659
C  -0.525821 -0.788442 0.678822
C  -3.338567 -0.464614 0.301434
C  -1.0110 0.346795 0.013741
C  1.922531 0.050817 0.405351
C  0.928865 -1.002114 0.905012
C  -1.44733 -1.77917 1.166644
C  -2.815121 -1.618111 0.981052
C  -2.930666 1.690098 -0.871805
C  2.633592 -0.044486 -0.827144
C  -4.742572 -0.273166 0.093757
C  2.275561 1.114921 1.256817
C  -4.305291 1.849723 -1.06013
C  -5.217916 0.859904 -0.573152
C  3.646671 0.89399 -1.15371
C  3.268689 2.06242 0.959698
C  3.963038 1.941232 -0.264608
C  2.280784 -1.13744 -1.776058
H  -0.31367 1.105732 -0.361596
H  -1.034168 -2.653224 1.679484
H  -3.516577 -2.374786 1.351661
H  -2.228694 2.446588 -1.24278
H  -5.4424 -1.030654 0.466094
H  -4.692448 2.732277 -1.580541
H  -6.294073 0.996366 -0.726689
H  4.172838 0.786037 -2.104996
H  3.485705 2.861668 1.674287
H  4.745567 2.662398 -0.519077
H  2.843862 -1.920381 -3.485269
