program: Gaussian 09
title: 000282449
version: EM64L-G09RevD.01
frameworkgroup: C1[X(C12H14O4)]
method: RPBEPBE
basis: SDD
operation: Freq
keyword: #pfreq=noraman
keyword: PBEPBE/SDD
title: #p freq=noraman PBEPBE/SDD
converged: YES YES NO NO
title: Mulliken charges:
elementType: O O O O C C C C C C C C C C C C H H H H H H H H H H H H H H
charge: -0.415959 -0.411454 -0.205143 -0.213314 0.124613 -0.243602 0.468882 -0.715130 -0.785099 0.159678 0.154960 -0.388607 -0.383768 -0.266828 -0.244170 -0.242332 0.297988 0.233522 0.221117 0.220984 0.262980 0.208982 0.249250 0.222285 0.248191 0.224551 0.224546 0.228795 0.383284 0.380798
chargesum: 0.00000
title: Mulliken charges with hydrogens summed into heavy atoms:
elementType: O O O O C C C C C C C C C C C C
charge: -0.032674 -0.030655 -0.205143 -0.213314 0.124613 0.054386 0.468882 -0.039507 -0.063888 0.159678 0.154960 -0.166322 -0.135576 -0.042277 -0.019625 -0.013537
polarizability: 1.69487401e+02 -1.52124925e+01 1.07178417e+02 5.28743990e-01 8.60812028e+00 1.31329903e+02
1716.lowfreq: -5.6823 -3.2797 -0.0007 -0.0007 -0.0002 10.1984 24.9256 40.3747 60.8942
frequency: 24.8679 40.3323 60.8810 63.1048 84.1621 141.2258 167.9477 191.7465 224.8437 242.5601 264.7426 284.1412 299.6825 320.1884 342.5345 371.9429 404.1713 419.4458 456.0992 510.3115 526.7923 541.6015 597.4069 616.0306 617.6463 632.6996 666.5436 703.7563 708.1432 750.0679 774.1363 827.9568 849.7330 895.8586 918.6591 936.6091 946.2721 969.6420 975.9529 991.3552 995.4231 1014.6409 1028.2445 1047.9226 1050.7923 1086.7891 1104.9374 1154.6907 1174.1877 1190.8456 1202.0404 1220.4210 1236.8179 1267.9447 1313.5525 1325.4214 1331.7636 1377.3762 1388.1127 1407.8640 1434.2492 1467.3017 1468.9513 1481.6642 1489.6392 1505.2974 1590.6206 1612.2644 1654.2161 1679.9930 2985.9054 2998.3055 3048.5875 3079.1634 3087.7063 3092.9927 3112.7435 3114.4707 3126.9376 3139.5815 3158.0745 3175.3806 3502.6800 3515.5998
redmass: 7.0860 4.2687 7.8251 8.7219 5.1284 6.3307 4.7387 3.9279 3.5382 1.1944 3.3481 3.0132 1.4313 2.1880 2.9700 7.6329 2.8031 3.6180 3.2267 3.0827 2.7596 2.9434 3.2878 1.4663 6.2172 2.0637 2.8940 1.7497 3.7449 3.6344 2.0062 3.9297 1.2506 3.7120 1.5706 2.0914 2.2163 2.8031 1.4261 5.2146 1.3486 1.3556 2.5392 2.2057 2.3412 1.6929 2.0054 2.4232 1.0578 2.3373 1.1645 1.5973 1.8242 2.1923 1.7211 1.3800 1.8981 6.4215 1.2040 1.2018 2.1966 1.0690 1.0761 1.2762 1.5220 1.0594 5.8869 6.0218 7.9765 9.3591 1.0354 1.0375 1.0818 1.0994 1.0985 1.0998 1.0864 1.0991 1.0867 1.0932 1.0980 1.0957 1.0639 1.0641
irintensity: 0.5456 0.4130 1.3629 1.6848 0.2793 0.1871 0.4917 2.0114 0.8211 0.3248 0.3758 0.5677 1.5027 3.2271 3.0070 2.2873 0.0369 1.4397 0.7456 16.6947 3.6812 34.7365 46.2169 165.5746 0.7549 69.9982 61.7305 43.7097 23.2394 1.8147 36.1456 11.0443 0.1411 7.2029 2.0186 13.2019 14.2175 51.5677 3.4155 2.2137 1.0776 24.8806 11.8845 237.5935 206.8941 32.2501 10.6216 21.0258 0.2360 38.7240 1.1632 4.1460 5.7717 11.8805 68.5517 1.1505 93.9873 1.3154 22.8486 21.9246 13.0569 2.3410 8.0482 4.7214 28.9515 11.5930 1.8283 5.9350 171.1129 217.0187 21.0001 22.6935 1.5399 25.8517 29.2934 24.6211 12.3402 10.2343 1.1208 31.4890 33.4575 8.6387 29.7131 29.9508
temp: 298.150 k
press: 1.00000 atm
elementType: 8 8 8 8 6 6 6 6 6 6 6 6 6 6 6 6 1 1 1 1 1 1 1 1 1 1 1 1 1 1
symmnumber: 1
zpe: 620885.3 jmol-1
zpe.correction: 0.236483 hartree
zpe.thermalcorrener: 0.252228 hartree
zpe.thermalcorrenthalpy: 0.253172 hartree
zpe.thermalcorrgfe: 0.192581 hartree
zpe.sumelectzpe: -765.391496 hartree
zpe.sumelectthermal: -765.375750 hartree
zpe.sumelectthermalent: -765.374806 hartree
zpe.sumelectthermalfe: -765.435397 hartree
dipole: -0.1437 -0.8654 -1.8053
dipole: 2.0071
quadrupole: -88.7023 -89.2945 -93.5242
quadrupole: -3.2327 -5.0172 -1.9742
quadrupole: 1.8047 1.2125 -3.0172 -3.2327 -5.0172 -1.9742
hfenergy: -765.6279784 hartree
pointgroup: C01 [X(C12H14O4)]
dipole: 0.106293 -0.3630612 0.6931563 debye
polarizability: 170.1142522|12.6086133|106.9243072|-2.6551595|-10.4602968|130.9571619 unknown
InChI: InChI=1S/C12H14O4/c1-12(2,8-6-4-3-5-7-8)9(10(13)14)11(15)16/h3-7,9,13,15H,1-2H3
charge 0 multiplicity 1
30 atoms
O  -1.677082 2.28509 1.218453
O  -2.952375 -1.031408 1.58894
O  -0.439268 2.181056 -0.738199
O  -3.472407 -0.030151 -0.438605
C  -0.27858 -0.815654 -0.530673
C  -1.146349 0.083952 0.444753
C  1.214673 -0.479363 -0.272018
C  -0.525214 -2.312483 -0.165063
C  -0.698033 -0.611412 -2.008556
C  -1.02212 1.591005 0.18969
C  -2.627594 -0.295391 0.44248
C  1.778474 -0.704862 1.014002
C  2.062929 0.032936 -1.284852
C  3.137703 -0.433454 1.278126
C  3.42611 0.303458 -1.026738
C  3.972107 0.072457 0.254818
H  -0.790424 -0.082751 1.476497
H  0.160553 -2.948763 -0.751291
H  -1.561009 -2.613838 -0.4059
H  -0.35368 -2.519909 0.905464
H  -0.539533 0.424877 -2.344909
H  -0.118937 -1.290965 -2.659531
H  -1.767811 -0.847265 -2.13873
H  1.158205 -1.108137 1.824587
H  1.662501 0.238669 -2.280829
H  3.544788 -0.618121 2.278756
H  4.058807 0.702231 -1.827905
H  5.028253 0.284825 0.45488
H  -1.614841 3.264202 1.048866
H  -3.918947 -1.272229 1.560188
