program: Gaussian 09
title: 000282443
version: EM64L-G09RevD.01
frameworkgroup: C1[X(C9H16O2)]
method: RPBEPBE
basis: SDD
operation: Freq
keyword: #pfreq=noraman
keyword: PBEPBE/SDD
title: #p freq=noraman PBEPBE/SDD
converged: YES YES NO NO
title: Mulliken charges:
elementType: O O C C C C C C C C C H H H H H H H H H H H H H H H H
charge: -0.481747 -0.441958 0.255064 -0.465006 -0.462621 -0.409269 -0.413919 -0.385380 -0.224029 -0.268249 -0.371798 0.236538 0.181427 0.183642 0.231207 0.212180 0.204796 0.205369 0.210183 0.187094 0.209163 0.242259 0.327354 0.299324 0.219100 0.184211 0.335064
chargesum: 0.00000
title: Mulliken charges with hydrogens summed into heavy atoms:
elementType: O O C C C C C C C C C
charge: -0.154393 -0.106894 0.255064 -0.047041 -0.047772 0.007707 0.001633 0.010878 0.018230 0.031075 0.031513
polarizability: 1.31813017e+02 1.90302949e+00 9.12332581e+01 -1.69855747e+00 6.96821374e-01 8.86559236e+01
1716.lowfreq: -14.5839 -4.1784 -0.0011 -0.0009 -0.0007 5.4356 32.7322 83.8093 98.4923
frequency: 32.5521 83.7559 98.4779 120.9335 189.6391 237.4851 257.5392 271.7194 304.6346 334.6861 349.6894 367.8017 397.8508 440.2000 448.0252 495.0851 526.7472 580.0203 736.6284 778.7351 812.9342 824.8845 848.5056 904.9530 916.4123 929.5275 935.1830 948.1748 990.3687 994.2227 1036.8349 1050.9494 1066.4999 1100.5958 1111.7396 1124.1685 1126.1443 1160.8954 1204.0713 1208.5093 1243.0884 1253.8056 1267.6436 1291.0217 1296.3771 1313.2964 1321.8104 1332.9889 1341.4907 1346.1952 1369.4184 1379.8977 1449.6840 1461.9515 1466.3471 1469.5254 1471.5161 1481.3611 1677.3048 2946.5838 2950.6741 2954.6210 2967.0491 2977.9705 2982.4547 3031.2949 3033.9795 3042.7646 3046.3706 3052.5476 3053.5207 3092.1087 3146.4998 3553.8945 3558.8606
redmass: 3.1812 3.8852 3.0779 2.7587 2.7372 1.8720 1.7422 1.5710 2.8191 1.8268 1.8235 1.6819 3.0379 3.3705 2.2917 3.4429 2.1658 2.7321 3.8914 1.4452 1.7842 2.2517 1.7116 2.2399 2.0793 1.5306 3.0603 2.3769 1.2045 1.6342 2.2219 2.8241 1.4233 1.5090 2.3457 1.4829 1.8301 1.2604 1.8248 1.4981 1.2671 1.3213 1.2346 1.2411 1.2962 1.3598 1.5080 1.3640 1.4542 1.4480 1.2583 1.6235 1.0852 1.0966 1.0918 1.0845 1.0850 1.0907 6.7695 1.0668 1.0678 1.0665 1.0636 1.0621 1.0618 1.0954 1.0998 1.0993 1.0965 1.0987 1.0945 1.0896 1.0905 1.0663 1.0658
irintensity: 0.0878 0.2162 2.5298 3.6476 0.9995 15.8596 24.5629 40.9162 51.5895 103.0828 3.1984 38.7026 19.6575 3.9725 5.9946 8.4670 4.3937 8.0844 16.2649 2.1264 2.8816 4.2614 13.0296 27.0313 17.0246 13.8861 64.9668 22.5571 62.1955 11.5506 20.6288 26.0354 4.0696 0.5818 16.1235 66.4475 3.0765 7.9594 5.0002 5.6358 5.3905 7.5169 0.9281 4.5272 13.1211 0.1493 8.4461 0.0239 0.2965 0.7833 21.8595 56.4218 6.9293 9.8731 6.0549 11.4908 17.1480 7.3406 1.6383 13.3281 72.0379 56.6464 35.3821 29.4688 30.0027 72.2435 52.3836 33.2425 30.2138 74.2340 26.8115 18.2263 2.5157 4.8564 5.8594
temp: 298.150 k
press: 1.00000 atm
elementType: 8 8 6 6 6 6 6 6 6 6 6 1 1 1 1 1 1 1 1 1 1 1 1 1 1 1 1
symmnumber: 1
zpe: 615919.5 jmol-1
zpe.correction: 0.234591 hartree
zpe.thermalcorrener: 0.246577 hartree
zpe.thermalcorrenthalpy: 0.247521 hartree
zpe.thermalcorrgfe: 0.196545 hartree
zpe.sumelectzpe: -502.078474 hartree
zpe.sumelectthermal: -502.066489 hartree
zpe.sumelectthermalent: -502.065545 hartree
zpe.sumelectthermalfe: -502.116520 hartree
dipole: -4.4890 -0.6155 0.3266
dipole: 4.5428
quadrupole: -81.4927 -65.8433 -65.3707
quadrupole: -3.0355 -0.3687 0.2050
quadrupole: -10.5904 5.0589 5.5315 -3.0355 -0.3687 0.2050
hfenergy: -502.3130656 hartree
pointgroup: C01 [X(C9H16O2)]
dipole: -1.7670578 -0.2569091 0.0764847 debye
polarizability: 131.7992506|2.0508267|90.5358278|-1.7308301|1.2984364|89.3671202 unknown
InChI: InChI=1S/C9H16O2/c10-8-4-7-9(11)5-2-1-3-6-9/h4,7,10-11H,1-3,5-6,8H2
charge 0 multiplicity 1
27 atoms
O  0.137226 1.86936 0.954578
O  4.237551 -0.73827 0.166948
C  -0.437163 0.65214 0.336354
C  -1.4323 1.068289 -0.789798
C  -1.194539 -0.171227 1.422384
C  -2.213104 -0.128628 -1.384206
C  -1.980499 -1.371292 0.839089
C  -2.951055 -0.922009 -0.27916
C  0.738112 -0.126047 -0.228561
C  2.025501 0.303984 -0.246048
C  3.160431 -0.506558 -0.823324
H  -0.874609 1.611069 -1.574736
H  -2.163238 1.782274 -0.350102
H  -1.914068 0.512939 1.92303
H  -0.471691 -0.502486 2.190596
H  -1.517048 -0.801611 -1.923004
H  -2.936518 0.240177 -2.136504
H  -2.540814 -1.87253 1.651651
H  -1.274787 -2.125128 0.436583
H  -3.739665 -0.27784 0.162957
H  -3.462962 -1.800883 -0.715959
H  0.492355 -1.105618 -0.663927
H  -0.609074 2.413079 1.314108
H  2.275886 1.277237 0.191861
H  3.673345 0.038726 -1.635121
H  2.785455 -1.471124 -1.229017
H  3.81807 -1.059723 1.005629
