program: Gaussian 09
title: 000282438
version: EM64L-G09RevD.01
frameworkgroup: C1[X(C15H12N2)]
method: RPBEPBE
basis: SDD
operation: Freq
keyword: #pfreq=noraman
keyword: PBEPBE/SDD
title: #p freq=noraman PBEPBE/SDD
converged: YES YES NO NO
title: Mulliken charges:
elementType: N N C C C C C C C C C C C C C C C H H H H H H H H H H H H
charge: 0.024707 -0.585060 0.234810 0.174463 0.276740 0.495188 0.288648 -0.756186 -0.392335 -0.358627 -0.394258 -0.463874 -0.267759 -0.266071 -0.261667 -0.249307 -0.391091 0.271971 0.224412 0.221037 0.214283 0.248263 0.227713 0.226012 0.225848 0.227841 0.190834 0.285367 0.328098
chargesum: 0.00000
title: Mulliken charges with hydrogens summed into heavy atoms:
elementType: N N C C C C C C C C C C C C C C C
charge: 0.024707 0.028405 0.234810 0.174463 0.276740 0.495188 0.288648 -0.484215 -0.167923 -0.137590 -0.179976 -0.215611 -0.040046 -0.040059 -0.035819 -0.021466 -0.200257
polarizability: 3.04017116e+02 -8.83648698e+00 2.43759214e+02 3.96197110e-02 -1.23116241e-02 6.59761031e+01
1716.lowfreq: -7.8203 -0.0008 -0.0004 0.0002 5.0937 9.3377 55.2206 64.7001 94.0143
frequency: 55.1999 64.6981 94.0142 114.8887 117.7939 218.6347 239.7377 242.6097 319.9456 324.4102 352.6461 357.6445 403.9246 424.3661 451.8665 461.1568 511.8894 540.4824 548.8997 567.8406 597.3233 614.5919 640.6945 687.8757 708.9992 735.6485 760.5854 776.1417 809.0676 809.1837 867.9313 890.5632 891.3834 896.2140 946.4439 953.6526 968.0999 986.5855 989.0765 990.5557 1026.5613 1040.3675 1054.3520 1103.9460 1133.2392 1158.8691 1176.1897 1179.4713 1188.5079 1216.5764 1258.1928 1269.8135 1284.3145 1321.3475 1370.3391 1381.7142 1403.3704 1421.1497 1444.0637 1445.3766 1450.5818 1497.7576 1532.8200 1561.1319 1577.2152 1602.6321 1619.4571 1621.9046 1651.7110 3016.9708 3121.6747 3126.9022 3131.7645 3141.2289 3142.1268 3148.2836 3158.1484 3163.9745 3169.5284 3426.3288 3682.7083
redmass: 3.9104 2.5067 3.6699 3.7005 4.5325 4.9941 4.8371 3.9514 6.3751 3.8283 4.3024 1.2050 6.5951 2.9865 3.3580 5.7655 2.9669 1.1875 4.6953 3.0780 6.6091 6.8459 3.0537 5.3721 5.5641 2.0624 1.4356 1.7150 3.2503 1.9883 1.4099 4.1283 1.6384 2.0206 1.6045 1.4209 1.5937 1.4008 1.3706 7.3963 4.2590 2.1144 2.2076 2.4985 2.5243 1.7329 1.0732 1.2631 1.2439 1.3877 1.5142 2.4819 1.8068 2.2249 1.9935 3.6724 4.5813 2.7722 2.6145 2.8199 2.9275 3.0782 3.6444 5.9115 7.4051 5.9039 6.1390 5.9846 1.1540 1.0854 1.0856 1.0850 1.0884 1.0904 1.0904 1.0937 1.0941 1.0992 1.0984 1.0502 1.0957
irintensity: 0.0392 5.6856 0.3607 10.7592 4.7614 1.6743 0.0818 0.4641 1.5269 0.2033 14.8182 341.5255 0.7413 11.6462 0.1665 0.1705 3.7603 0.0063 2.8994 0.9744 12.0848 4.4716 1.2261 3.0801 1.3396 67.9980 49.2927 53.1186 6.0174 7.8536 0.0831 6.7470 9.6742 12.4089 6.6785 0.0320 27.9527 2.2460 2.6688 2.8353 18.6482 10.4652 2.7730 4.1229 89.7258 37.0610 0.9111 33.9578 2.0403 6.5458 11.0419 0.3127 0.2208 0.8248 3.3308 8.1601 0.6310 2.9034 17.9108 7.1125 16.6104 12.1717 2.0300 267.7267 0.7736 0.7665 2.1818 1.0819 18.1729 60.6799 2.3157 0.0622 4.0935 8.1440 18.1608 10.5461 21.1098 74.3220 27.4425 25.9375 83.4557
temp: 298.150 k
press: 1.00000 atm
elementType: 7 7 6 6 6 6 6 6 6 6 6 6 6 6 6 6 6 1 1 1 1 1 1 1 1 1 1 1 1
symmnumber: 1
zpe: 600261.5 jmol-1
zpe.correction: 0.228628 hartree
zpe.thermalcorrener: 0.242095 hartree
zpe.thermalcorrenthalpy: 0.243039 hartree
zpe.thermalcorrgfe: 0.188356 hartree
zpe.sumelectzpe: -687.133508 hartree
zpe.sumelectthermal: -687.120041 hartree
zpe.sumelectthermalent: -687.119097 hartree
zpe.sumelectthermalfe: -687.173779 hartree
dipole: -2.6969 0.3167 -0.0047
dipole: 2.7154
quadrupole: -66.1254 -86.0037 -107.5063
quadrupole: 3.3785 0.0425 0.0035
quadrupole: 20.4197 0.5414 -20.9612 3.3785 0.0425 0.0035
hfenergy: -687.3621356 hartree
pointgroup: C01 [X(C15H12N2)]
dipole: 1.0669752 0.0535682 0.0043087 debye
polarizability: 305.2426095|1.5207491|242.506443|1.2256848|1.9334177|66.0033809 unknown
InChI: InChI=1S/C15H12N2/c16-17-10-12-9-11-5-1-2-6-13(11)15-8-4-3-7-14(12)15/h1-10H,16H2
charge 0 multiplicity 1
29 atoms
N  3.015842 2.297716 0.061941
N  4.332761 2.652403 0.072734
C  -0.464667 -1.222923 0.001136
C  -1.511856 -0.197898 0.007106
C  0.930514 -0.836702 0.010915
C  -1.119121 1.189794 0.022116
C  1.288824 0.586056 0.027138
C  0.27153 1.540009 0.031751
C  -0.786187 -2.61585 -0.013921
C  -2.908035 -0.500817 -0.000985
C  1.922477 -1.87015 0.004901
C  -2.123572 2.211141 0.027659
C  0.205144 -3.603829 -0.019615
C  1.575524 -3.226253 -0.010155
C  -3.876122 0.513653 0.004842
C  -3.482933 1.883863 0.019138
C  2.696616 1.013627 0.039285
H  0.553427 2.598441 0.043721
H  -1.834193 -2.929146 -0.021387
H  -3.245367 -1.541703 -0.011844
H  2.984557 -1.609751 0.012377
H  -1.804519 3.260018 0.03901
H  -0.074126 -4.663006 -0.031217
H  2.357559 -3.993555 -0.014487
H  -4.940071 0.252048 -0.001593
H  -4.243871 2.671892 0.023509
H  3.489023 0.244483 0.029571
H  5.101088 1.971897 0.062373
H  4.530156 3.646743 0.090682
