program: Gaussian 09
title: 000286524
version: EM64L-G09RevD.01
frameworkgroup: C1[X(C22H25Br3O2)]
method: RPBEPBE
basis: SDD
operation: Freq
keyword: #p
keyword: freq=noraman
keyword: PBEPBE/SDD
title: #p freq=noraman PBEPBE/SDD
converged: YES YES NO NO
title: Mulliken charges:
elementType: Br Br Br O O C C C C C C C C C C C C C C C C C C C C C C H H H H H H H H H H H H H H H H H H H H H H H H H
charge: 0.060342 0.058198 0.047562 -0.300093 -0.176159 0.499749 0.407320 0.605247 -0.220313 -0.221902 -0.056626 -0.271148 -0.712843 -0.625795 -0.706316 -0.705198 -0.712400 -0.698002 -0.695049 -0.694401 0.021408 0.634867 -0.351997 -0.319641 -0.151861 -0.154280 -0.233423 0.231847 0.234397 0.214168 0.242768 0.235558 0.208275 0.216658 0.227128 0.246254 0.213734 0.210561 0.202784 0.220610 0.228725 0.250594 0.213543 0.207898 0.213310 0.214716 0.228397 0.228476 0.214665 0.213341 0.277640 0.276708
chargesum: 0.00000
title: Mulliken charges with hydrogens summed into heavy atoms:
elementType: Br Br Br O O C C C C C C C C C C C C C C C C C C C C C C
charge: 0.060342 0.058198 0.047562 -0.300093 -0.176159 0.499749 0.407320 0.605247 0.011533 0.012495 -0.056626 -0.056980 -0.470075 -0.390237 -0.054255 -0.034649 -0.060280 -0.025967 -0.038626 -0.037919 0.021408 0.634867 -0.351997 -0.319641 0.125779 0.122428 -0.233423
polarizability: 4.16923971e+02 3.47431067e+00 2.99830533e+02 1.63518541e+01 1.89958564e+00 2.02399436e+02
1716.lowfreq: -8.9111 -1.8303 0.0003 0.0005 0.0006 4.1568 8.4441 11.5777 20.5376
frequency: -3.4077 11.3988 20.4403 22.7181 29.4461 40.0993 48.3147 56.3500 79.7514 83.6208 94.3724 111.8429 117.8831 126.7159 129.0709 134.5095 150.4427 178.1477 182.4259 193.3145 209.8474 214.0484 221.7927 223.6021 237.5163 244.1391 251.0712 253.4474 260.1844 267.6719 305.9657 308.9294 316.7419 345.4507 346.4542 352.7749 365.5580 373.2167 430.0517 448.2513 469.2094 500.0953 513.9224 524.2093 544.4873 570.6910 594.2226 610.1070 637.9967 643.3077 662.5441 688.3006 702.2307 710.9587 775.7927 794.2150 813.6864 819.8918 841.4317 865.6673 875.3422 882.4304 904.9494 909.4260 915.2275 920.9031 922.8421 924.7454 946.8298 947.4045 954.1598 957.8805 959.0255 1024.7344 1056.1377 1078.9427 1095.8321 1100.5268 1109.9899 1115.0244 1116.3720 1126.9213 1159.8651 1173.8911 1177.1883 1189.2077 1199.8818 1222.0125 1254.0495 1282.0270 1290.5838 1309.4958 1310.0918 1314.7730 1329.9278 1340.4291 1346.5398 1358.2111 1375.3758 1376.5090 1377.1148 1389.6188 1395.6054 1395.9626 1398.5338 1406.6659 1434.0859 1452.9551 1464.4852 1466.1952 1467.5333 1467.8981 1468.7632 1469.6908 1479.2270 1479.6727 1486.7294 1487.2369 1488.6993 1489.2093 1543.2946 1557.1376 1566.8383 1612.3896 1655.3155 2974.2048 2975.0339 2976.0543 2976.5995 2977.5032 2978.6998 2982.2321 3030.1643 3047.8011 3065.2693 3066.6511 3069.1179 3075.3051 3075.6409 3076.1045 3076.8203 3078.8131 3080.6404 3083.0042 3088.6296 3092.6490 3122.9993 3135.0273 3186.5201 3188.5446
redmass: 3.7262 4.8179 10.6266 4.4749 3.3700 4.1561 5.1209 3.9889 3.2380 9.2861 5.4595 36.9617 7.5911 3.1630 3.3708 11.7400 3.6218 4.5783 4.1904 2.2503 1.0961 1.1938 14.4637 1.3062 1.2022 1.3916 1.2484 1.3073 4.9520 4.0330 4.6538 3.6130 2.9871 5.7280 4.5183 5.6580 3.3431 4.2534 2.6271 4.6006 2.9916 4.9909 4.5664 7.2156 4.8750 2.8187 3.8696 3.4846 4.7634 4.8289 3.8971 5.9152 5.5943 9.7323 9.2449 4.7313 4.6910 3.7583 3.6538 1.4415 1.3699 2.5783 1.7379 1.3440 2.3686 1.2823 1.2273 1.5576 3.1448 2.3640 1.4642 1.4113 1.4454 6.1374 1.5643 1.6082 2.4093 1.7983 2.5577 2.6213 2.6226 2.1442 2.0138 2.2523 2.6165 1.5852 2.2082 2.1681 1.5337 2.5226 1.3794 1.3491 1.3377 2.1745 1.9285 4.6458 1.9700 4.5680 1.1977 1.1925 1.1960 1.6778 1.2633 1.2145 1.2741 3.0331 2.4795 2.2457 1.0651 1.0460 1.0511 1.0546 1.0557 1.0697 1.0492 1.0480 1.0524 1.0654 1.0830 1.0689 9.5679 8.2208 7.2947 5.6541 12.4975 1.0349 1.0350 1.0349 1.0354 1.0355 1.0353 1.0842 1.0843 1.0871 1.0999 1.0999 1.0999 1.0995 1.0997 1.0994 1.0982 1.1005 1.0968 1.0997 1.0986 1.0997 1.0900 1.0897 1.0931 1.0938
irintensity: 0.0451 0.0240 0.0787 0.0493 0.1327 0.0253 0.2311 0.3469 0.6046 0.8305 0.2563 0.0230 0.2005 0.1790 0.2763 0.1015 0.6192 0.1903 1.5238 2.0395 0.1258 0.3006 0.1287 0.4669 0.1948 0.0230 0.0617 0.0598 1.1264 0.3931 3.9981 2.7525 0.0649 1.6205 2.5759 4.8258 0.3129 0.9015 0.1610 0.8164 0.2708 0.0781 0.4052 7.1675 9.4312 0.2958 5.3298 3.3546 1.4693 6.4271 6.3632 44.9263 35.6610 68.0107 51.3723 13.4540 7.7155 7.0343 15.4947 30.9495 0.3829 12.9485 9.9538 3.7921 242.2563 22.7960 3.9415 76.7352 188.9485 50.9418 0.1216 0.8407 14.8740 41.2066 38.0270 11.7291 27.9155 32.3863 1.3357 3.7545 3.4564 14.1184 30.1472 64.2555 96.3703 9.7513 99.0634 21.8905 14.6488 18.4729 1.5924 0.8828 4.2434 0.4092 1.2278 20.5115 4.3752 24.0184 14.2626 9.8804 27.2124 6.4093 18.6101 9.8319 15.3098 189.4104 16.6882 2.7058 4.8702 1.7627 8.0690 1.3644 2.6941 3.6315 13.1730 14.3460 12.4863 20.5404 10.6421 7.8732 63.5466 65.7715 32.7151 96.8472 196.1666 24.1178 24.0951 34.6920 46.7202 20.7779 45.5692 17.5982 1.9105 14.2339 0.2645 2.0074 2.7950 56.0286 96.9928 88.6129 27.1765 24.8410 45.0740 36.1157 34.6859 23.6992 20.1893 16.4905 0.7920 0.2172
temp: 298.150 k
press: 1.00000 atm
elementType: 35 35 35 8 8 6 6 6 6 6 6 6 6 6 6 6 6 6 6 6 6 6 6 6 6 6 6 1 1 1 1 1 1 1 1 1 1 1 1 1 1 1 1 1 1 1 1 1 1 1 1 1
symmnumber: 1
zpe: 1072494.9 jmol-1
zpe.correction: 0.408492 hartree
zpe.thermalcorrener: 0.438150 hartree
zpe.thermalcorrenthalpy: 0.439094 hartree
zpe.thermalcorrgfe: 0.343955 hartree
zpe.sumelectzpe: -1042.168220 hartree
zpe.sumelectthermal: -1042.138562 hartree
zpe.sumelectthermalent: -1042.137618 hartree
zpe.sumelectthermalfe: -1042.232757 hartree
dipole: -2.0636 -0.0243 -1.2120
dipole: 2.3934
quadrupole: -170.6154 -180.7615 -196.0747
quadrupole: 0.7989 1.6428 -1.8874
quadrupole: 11.8684 1.7224 -13.5909 0.7989 1.6428 -1.8874
hfenergy: -1042.5767122 hartree
pointgroup: C01 [X(C22H25Br3O2)]
dipole: -0.8248559 -0.1660966 0.4226924 debye
polarizability: 417.4074836|-1.8072117|280.1735528|-11.9730566|39.6332154|221.5729024 unknown
InChI: InChI=1S/C22H25Br3O2/c1-11(2)14-7-16(12(3)4)20(17(8-14)13(5)6)22(26)27-21-18(24)9-15(23)10-19(21)25/h7-13H,1-6H3
charge 0 multiplicity 1
52 atoms
Br 2.085078 1.645184 2.300251
Br 2.818583 -2.427338 -1.807659
Br 7.402963 0.266935 0.460917
O  1.274816 -0.571972 0.293768
O  0.989935 0.747741 -1.623003
C  -1.612421 -1.274967 -0.143309
C  -1.758138 1.211554 -0.299982
C  -3.768008 -0.123422 0.260042
C  -0.860999 -2.608509 -0.252055
C  -1.148506 2.598053 -0.560344
C  -0.995314 -0.005289 -0.370723
C  -5.256421 -0.194047 0.607498
C  -2.99172 -1.298847 0.170798
C  -3.130908 1.116125 0.016827
C  -1.558268 -3.591022 -1.230541
C  -0.678528 -3.25158 1.149228
C  -1.616565 3.666616 0.460279
C  -1.457117 3.048828 -2.01583
C  -6.138667 0.354436 -0.545965
C  -5.566165 0.543176 1.938232
C  0.455087 0.111721 -0.698393
C  2.668829 -0.358048 0.259352
C  3.244479 0.583746 1.149607
C  3.538103 -1.107465 -0.570305
C  4.638119 0.779181 1.223762
C  4.936682 -0.931232 -0.523575
C  5.46576 0.013009 0.378285
H  0.148051 -2.41811 -0.652488
H  -0.050013 2.530827 -0.472624
H  -5.516102 -1.26268 0.748706
H  -3.478119 -2.266245 0.344063
H  -3.717705 2.038808 0.083593
H  -2.556175 -3.898386 -0.867521
H  -0.948197 -4.507059 -1.339808
H  -1.684861 -3.138831 -2.230993
H  -0.126349 -2.571646 1.821048
H  -0.109628 -4.196418 1.066342
H  -1.655254 -3.481851 1.615029
H  -2.691011 3.904286 0.352721
H  -1.056507 4.605809 0.297137
H  -1.440117 3.335453 1.500083
H  -1.042196 2.330199 -2.742952
H  -1.00776 4.039696 -2.213787
H  -2.548342 3.125902 -2.181011
H  -5.934736 1.425961 -0.727838
H  -7.210708 0.253036 -0.294625
H  -5.949676 -0.190236 -1.488362
H  -4.966269 0.134882 2.771285
H  -6.636236 0.439908 2.197204
H  -5.34125 1.622913 1.857176
H  5.059875 1.508686 1.918193
H  5.589295 -1.517973 -1.173335
