program: Gaussian 09
title: 000282427
version: EM64L-G09RevD.01
frameworkgroup: C1[X(C11H14Cl3NO)]
method: RPBEPBE
basis: SDD
operation: Freq
keyword: #p
keyword: freq=noraman
keyword: PBEPBE/SDD
title: #p freq=noraman PBEPBE/SDD
converged: YES YES NO NO
title: Mulliken charges:
elementType: Cl Cl Cl O N C C C C C C C C C C C H H H H H H H H H H H H H H
charge: 0.082471 0.077786 0.112751 -0.431719 -0.095206 0.127760 0.540067 -0.382912 -0.628040 -0.699992 -0.503948 0.354807 -0.548746 0.004165 -0.710945 -0.793624 0.270084 0.238273 0.238244 0.242098 0.222959 0.245410 0.294025 0.224365 0.222108 0.222824 0.238463 0.217067 0.244778 0.374626
chargesum: 0.00000
title: Mulliken charges with hydrogens summed into heavy atoms:
elementType: Cl Cl Cl O N C C C C C C C C C C C
charge: 0.082471 0.077786 0.112751 -0.057092 -0.095206 0.127760 0.540067 -0.112829 -0.628040 0.018623 -0.035579 0.354807 -0.254721 0.004165 -0.041647 -0.093315
polarizability: 2.25274832e+02 -9.00627555e+00 1.65153091e+02 2.62748585e+01 4.46226649e+00 1.18924010e+02
1716.lowfreq: -11.9776 -5.2108 -0.0022 -0.0020 0.0013 9.0538 18.6051 42.1793 75.1407
frequency: 15.6179 42.1371 75.1291 101.6244 125.2368 153.1841 161.4983 170.3570 185.6506 199.7198 210.8779 224.0362 235.3731 258.7716 267.3499 274.3701 283.1463 289.5000 311.0540 325.9825 363.5897 399.2454 422.2832 437.5622 487.4498 506.3165 534.8398 567.0160 580.8869 644.0188 679.1158 703.0016 708.7055 726.3885 783.5568 830.6392 857.3018 884.0727 908.0339 920.7037 946.2227 971.8652 1019.9443 1049.0782 1057.8568 1067.2541 1084.5809 1093.7031 1120.4470 1167.2139 1211.7838 1254.5185 1272.0429 1295.4103 1312.7381 1368.0073 1383.3560 1396.7622 1399.6588 1428.3741 1447.2225 1452.6364 1462.6351 1469.1863 1480.3304 1483.7924 1493.8872 1535.8125 1628.0673 1673.6611 2985.0823 2986.7256 2989.8905 3002.8181 3026.2955 3072.4117 3081.9748 3083.5797 3097.7939 3104.2470 3113.3540 3142.1103 3183.3448 3572.1346
redmass: 6.5005 7.9972 2.5728 2.8050 4.4632 1.2360 2.8929 4.5436 6.2279 9.9563 2.0602 2.8157 2.8269 5.5552 3.5346 8.3941 3.1071 1.3070 5.1720 2.8422 10.3888 2.4508 4.8557 1.6770 3.6180 2.5387 4.2627 4.0918 4.2554 4.6307 4.6243 4.7262 6.6815 6.1808 1.3800 3.5187 1.3498 3.6298 5.5623 1.3995 1.9776 2.0438 1.8944 1.5642 2.6407 1.9728 1.7326 2.0455 2.7888 3.8544 2.9554 1.4110 1.1408 1.4602 1.4168 1.6266 1.1929 1.2261 1.2195 3.1013 1.0906 1.0460 1.0548 1.0979 1.0474 1.0504 1.0547 5.9920 7.2378 7.2517 1.0359 1.0602 1.0360 1.0345 1.0967 1.0967 1.0996 1.1000 1.1009 1.1005 1.1001 1.0901 1.0898 1.0675
irintensity: 0.1413 0.0236 0.0692 1.1643 1.4239 0.1046 0.3829 0.9529 0.2112 0.8125 0.4288 0.1444 1.7857 0.6137 1.1342 3.3727 0.3628 2.9084 0.6028 3.2210 3.2402 55.0451 7.0260 63.1747 34.5117 21.1307 12.5229 20.4933 15.6140 14.3802 24.5280 38.3911 132.0167 85.3385 8.5748 10.0027 31.0191 127.0601 149.4277 24.5932 1.3280 17.0302 2.3225 8.0481 5.8749 2.9573 0.7291 11.0875 3.3632 8.2771 15.5025 55.9854 0.6033 16.0324 17.3787 15.8611 16.7335 10.6524 20.4449 10.5559 14.4269 12.9311 10.6151 10.1911 13.3685 6.6296 11.8152 0.4738 28.9939 1.7784 27.3865 7.0443 20.2127 14.0248 5.6957 12.4530 34.7956 32.5865 16.3772 12.9398 13.5833 7.8764 2.5561 88.7729
temp: 298.150 k
press: 1.00000 atm
elementType: 17 17 17 8 7 6 6 6 6 6 6 6 6 6 6 6 1 1 1 1 1 1 1 1 1 1 1 1 1 1
symmnumber: 1
zpe: 594096.4 jmol-1
zpe.correction: 0.226279 hartree
zpe.thermalcorrener: 0.244359 hartree
zpe.thermalcorrenthalpy: 0.245303 hartree
zpe.thermalcorrgfe: 0.179920 hartree
zpe.sumelectzpe: -1936.425262 hartree
zpe.sumelectthermal: -1936.407182 hartree
zpe.sumelectthermalent: -1936.406238 hartree
zpe.sumelectthermalfe: -1936.471621 hartree
dipole: 1.5191 0.8302 -1.8574
dipole: 2.5390
quadrupole: -113.5439 -110.3015 -115.2148
quadrupole: -1.4237 5.2423 1.0446
quadrupole: -0.5238 2.7186 -2.1948 -1.4237 5.2423 1.0446
hfenergy: -1936.651541 hartree
pointgroup: C01 [X(C11H14Cl3N1O1)]
dipole: -0.5120592 0.3637235 0.7767499 debye
polarizability: 228.8588649|-0.5812966|164.5247772|19.9444306|-5.4925502|115.9682909 unknown
InChI: InChI=1S/C11H14Cl3NO/c1-4-8-5-9(15-16)7(2)6-10(8,3)11(12,13)14/h5-6,16H,4H2,1-3H3
charge 0 multiplicity 1
30 atoms
Cl 3.522924 0.567409 -0.605315
Cl 2.799562 -2.31923 -0.402941
Cl 1.283834 -0.532081 -2.31903
O  -3.750678 1.07528 -0.759579
N  -3.241816 -0.254458 -0.4232
C  0.962193 -0.293546 0.504763
C  0.205455 1.032888 0.221111
C  0.016791 -1.496104 0.544015
C  2.039644 -0.600909 -0.61781
C  1.676881 -0.227913 1.895131
C  0.958281 2.357361 0.292816
C  -1.319153 -1.482214 0.267175
C  -1.136643 1.01426 -0.046989
C  -1.946391 -0.200094 -0.10132
C  0.086559 3.630408 0.2907
C  -2.167494 -2.734123 0.339955
H  0.48474 -2.440345 0.840993
H  2.134671 -1.201461 2.139492
H  2.46486 0.5416 1.9231
H  0.91938 0.00491 2.662466
H  1.597715 2.364887 1.196885
H  1.667629 2.415374 -0.555204
H  -1.669304 1.951406 -0.220457
H  0.730169 4.520806 0.406256
H  -0.643947 3.627659 1.120058
H  -0.470917 3.746305 -0.656205
H  -2.998196 -2.609539 1.057554
H  -1.560829 -3.605017 0.639803
H  -2.633086 -2.944255 -0.639689
H  -4.700834 0.887535 -0.969736
