program: Gaussian 09
title: 000282435
version: EM64L-G09RevD.01
frameworkgroup: C1[X(C18H9ClO4S)]
method: RPBEPBE
basis: SDD
operation: Freq
keyword: #p
keyword: freq=noraman
keyword: PBEPBE/SDD
title: #p freq=noraman PBEPBE/SDD
converged: YES YES NO NO
title: Mulliken charges:
elementType: Cl S O O O O C C C C C C C C C C C C C C C C C C H H H H H H H H H
charge: -0.199109 0.871507 -0.222267 -0.175486 -0.452286 -0.458919 0.120598 0.243911 0.254350 0.539848 -0.133738 0.283457 0.288577 -0.248143 -0.327673 -0.446794 -0.439781 -0.364982 -0.265997 -0.244275 -0.371219 -0.367405 -0.223908 -0.225256 0.301815 0.296905 0.327158 0.303872 0.255111 0.294770 0.294030 0.245117 0.246213
chargesum: 0.00000
title: Mulliken charges with hydrogens summed into heavy atoms:
elementType: Cl S O O O O C C C C C C C C C C C C C C C C C C
charge: -0.199109 0.871507 -0.222267 -0.175486 -0.452286 -0.458919 0.120598 0.243911 0.254350 0.539848 -0.133738 0.283457 0.288577 -0.248143 -0.327673 -0.144978 -0.142876 -0.037824 0.037875 0.010836 -0.076449 -0.073375 0.021208 0.020957
polarizability: 4.41046898e+02 -8.59305330e+00 2.73225937e+02 2.94980633e+00 1.82199515e+00 1.26492653e+02
1716.lowfreq: -8.7831 -0.0010 0.0012 0.0019 3.5663 5.8449 25.1049 28.5997 42.7152
frequency: 25.0659 28.5830 42.7068 66.3327 86.4746 111.7886 119.3309 149.8467 169.5863 173.3283 189.7573 219.2189 221.8624 240.7198 264.0588 270.4225 293.8379 328.0403 372.2575 382.8661 396.7895 412.0241 419.2880 433.7394 459.0917 463.9265 467.3960 501.4267 533.8147 556.4927 562.2905 612.3095 636.5211 654.6790 673.2003 698.1944 729.8247 742.0629 766.6842 798.6342 807.3370 821.2402 824.4552 842.5733 867.6431 886.2954 888.0405 943.4038 953.3971 959.1896 979.0574 1000.3234 1013.7881 1018.0804 1025.8459 1028.0145 1042.7885 1079.5021 1091.9863 1158.6188 1173.4255 1180.8988 1190.0896 1198.0663 1235.9892 1263.3279 1272.6199 1308.7851 1339.6464 1375.7196 1397.2753 1401.5233 1411.8408 1438.5315 1449.4712 1472.6495 1489.7114 1528.3334 1539.5425 1561.9885 1589.2271 1600.4005 1607.3841 1617.1544 3140.9780 3155.3829 3155.7578 3163.1851 3166.9645 3170.3798 3175.6952 3181.4499 3188.9564
redmass: 8.4332 13.5553 10.0951 6.7193 11.6610 9.0846 5.0790 7.0704 8.0371 11.9965 5.2316 12.4027 7.8855 10.6631 7.6142 4.8819 6.5014 9.5452 8.0972 10.6162 9.8644 4.6663 6.8688 6.1521 6.4793 11.8177 4.1780 3.9682 7.9374 4.7268 6.4399 4.4293 7.2395 7.4583 7.4660 3.9229 2.3824 6.9894 2.1698 5.9620 1.8080 2.0558 4.3791 6.9545 2.3001 2.0237 5.5330 2.1107 12.5531 1.4311 6.7940 1.3919 1.3943 1.3887 1.3515 3.5185 2.4320 2.2156 2.2069 1.9940 1.0958 1.4393 2.3736 1.4491 2.0859 1.8491 2.1038 3.4879 3.3401 3.9547 2.8937 8.3035 5.6368 2.4808 2.5442 2.7033 3.6224 9.3968 8.8394 7.8855 6.6440 7.3418 6.9865 7.2558 1.0867 1.0886 1.0906 1.0890 1.0948 1.0949 1.1000 1.0976 1.0963
irintensity: 0.6012 0.1069 5.0069 1.3014 4.2249 1.1697 0.1906 1.2692 0.1207 1.0346 1.1467 3.5381 1.8939 4.7138 3.5393 0.2324 6.1208 1.3283 10.5871 34.6912 75.6428 2.7902 43.2058 39.9943 3.8251 8.3489 25.9611 7.2997 5.7285 5.4410 5.9037 4.9227 7.0919 3.7466 1.5298 0.6436 55.0048 0.7170 23.3040 8.5042 35.4926 27.9560 98.2194 22.8025 13.0158 12.1261 1.6390 0.8885 53.6853 1.6779 59.3523 3.3415 4.6784 0.3567 5.0791 9.9485 8.0803 11.2488 4.6833 12.5695 9.5253 8.6533 2.6883 6.3501 77.7586 52.1169 230.3297 429.1125 1.5375 8.3675 27.5160 15.9184 16.3111 4.9794 49.0164 11.9281 28.2318 9.2731 151.9281 93.5586 0.5261 5.2072 2.1667 0.2096 3.5151 5.3672 5.5560 7.3276 1.3010 22.1604 27.8662 0.6569 42.9573
temp: 298.150 k
press: 1.00000 atm
elementType: 17 16 8 8 8 8 6 6 6 6 6 6 6 6 6 6 6 6 6 6 6 6 6 6 1 1 1 1 1 1 1 1 1
symmnumber: 1
zpe: 578085.8 jmol-1
zpe.correction: 0.220181 hartree
zpe.thermalcorrener: 0.239879 hartree
zpe.thermalcorrenthalpy: 0.240823 hartree
zpe.thermalcorrgfe: 0.170550 hartree
zpe.sumelectzpe: -1848.578672 hartree
zpe.sumelectthermal: -1848.558974 hartree
zpe.sumelectthermalent: -1848.558030 hartree
zpe.sumelectthermalfe: -1848.628303 hartree
dipole: 7.0146 3.5757 0.1344
dipole: 7.8745
quadrupole: -150.6470 -151.5651 -158.7341
quadrupole: -9.2102 1.0034 -0.1392
quadrupole: 3.0017 2.0836 -5.0854 -9.2102 1.0034 -0.1392
hfenergy: -1848.7988529 hartree
pointgroup: C01 [X(C18H9Cl1O4S1)]
dipole: -2.6795484 -1.5529674 -0.0794797 debye
polarizability: 441.478044|0.4561292|272.5939451|3.1730942|5.6910234|126.6934994 unknown
InChI: InChI=1S/C18H9O4S.Cl/c19-17-12-4-1-2-5-13(12)18(20)16-11-6-3-7-15(23(21)22)10(11)8-9-14(16)17;/h1-9H;
charge 0 multiplicity 1
33 atoms
Cl 4.761743 1.593214 2.040417
S  4.804688 0.641319 -0.193172
O  -1.629252 -2.540625 0.085056
O  -2.224025 2.927706 -0.044961
O  4.599299 1.878223 -1.217628
O  6.11284 -0.302062 -0.314816
C  -0.515693 -0.362645 0.014513
C  0.847553 -0.874695 0.001217
C  -0.725184 1.038728 -0.027635
C  1.953046 0.078047 -0.074242
C  -1.71849 -1.269825 0.066031
C  -3.082403 -0.647753 0.092907
C  -3.270056 0.76123 0.057892
C  -2.093804 1.663981 -0.007749
C  3.271358 -0.475153 -0.087676
C  0.3754 1.944174 -0.091931
C  1.685123 1.485328 -0.119355
C  1.161588 -2.276718 0.067975
C  3.572823 -1.828935 -0.010999
C  2.479146 -2.738458 0.057719
C  -4.214096 -1.49887 0.153409
C  -4.576532 1.307655 0.083179
C  -5.512959 -0.951618 0.179231
C  -5.696076 0.454425 0.144108
H  0.147398 3.013439 -0.122383
H  2.508851 2.199348 -0.189808
H  0.332129 -2.982341 0.127988
H  4.610083 -2.177416 -0.010781
H  2.682444 -3.812344 0.10802
H  -4.049419 -2.580006 0.178681
H  -4.684883 2.396244 0.054282
H  -6.383191 -1.614618 0.226342
H  -6.706554 0.875522 0.164267
