program: Gaussian 09
title: 000282400
version: EM64L-G09RevD.01
frameworkgroup: C1[X(C7H13NO2)]
method: RPBEPBE
basis: SDD
operation: Freq
keyword: #p
keyword: freq=noraman
keyword: PBEPBE/SDD
title: #p freq=noraman PBEPBE/SDD
converged: YES YES NO NO
title: Mulliken charges:
elementType: O O N C C C C C C C H H H H H H H H H H H H H
charge: -0.427090 -0.216987 -0.101253 -0.159917 -0.519866 -0.383516 -0.019153 0.192375 -0.701901 -0.707611 0.238850 0.242065 0.256368 0.232938 0.189328 0.177788 0.208707 0.226532 0.222793 0.247841 0.204765 0.220306 0.376636
chargesum: 0.00000
title: Mulliken charges with hydrogens summed into heavy atoms:
elementType: O O N C C C C C C C
charge: -0.050454 -0.216987 -0.101253 0.078933 -0.021433 0.038750 0.158635 0.192375 -0.043868 -0.034698
polarizability: 9.70144187e+01 -1.93449713e+00 9.25425214e+01 1.88376412e+00 2.85355604e+00 7.23620032e+01
1716.lowfreq: -6.2190 -0.0004 0.0007 0.0009 10.5203 17.7245 38.8537 70.2530 109.4903
frequency: 38.5568 70.1496 109.4787 159.2053 174.3842 212.7405 231.9312 256.1975 303.5512 327.1003 378.6131 439.2742 459.1178 586.7927 597.8394 628.4399 685.7996 768.3719 827.1871 877.8639 903.3547 925.9116 946.7373 958.8887 986.6791 1017.3129 1041.2368 1053.9446 1080.3130 1120.8754 1159.1141 1168.2226 1194.5683 1203.5441 1234.3400 1244.1252 1254.6700 1288.1777 1327.7698 1340.8891 1367.9609 1378.6184 1395.3720 1460.7790 1463.2406 1472.4250 1476.7073 1485.2529 1494.2725 1670.4542 2817.3877 2925.3975 2962.4612 2981.7655 2984.8087 3051.4895 3059.3603 3077.2536 3082.5272 3088.1304 3090.4646 3132.7028 3504.5484
redmass: 7.8088 2.8709 3.3290 2.8077 2.6078 1.0639 2.3167 1.3396 3.2510 2.5123 4.2649 2.9239 2.7789 2.3075 2.9450 1.7774 2.3434 3.1069 1.4900 2.5305 2.8615 1.1657 1.4996 2.3618 2.9173 4.9257 2.1546 2.0053 1.7093 1.7231 1.6924 1.9535 1.4239 2.2219 1.4078 1.4539 1.3730 1.3930 1.5591 1.3805 1.7160 1.2332 1.2158 1.0960 1.0522 1.0462 1.0550 1.1083 1.0524 8.7151 1.0811 1.0682 1.0843 1.0349 1.0356 1.0685 1.0870 1.0993 1.1000 1.0999 1.0998 1.1087 1.0639
irintensity: 1.0720 0.1624 0.2517 0.6929 1.8325 0.1914 2.0077 1.1079 0.4102 2.6068 12.4474 4.2626 3.5000 33.6371 8.4425 75.0351 67.2807 8.4940 2.1269 4.0891 9.5559 4.9988 0.7098 0.7071 68.9469 24.0976 142.2838 19.7133 23.6566 23.1756 0.4103 7.9983 4.7674 39.3251 3.3066 15.1646 21.6973 8.3978 2.8865 33.7960 16.5935 26.9121 20.9119 9.8292 8.2167 0.3046 10.4935 0.2880 18.1237 191.6672 94.2631 84.0779 46.6970 27.2028 23.1244 25.3845 40.8359 32.4479 15.0054 27.0680 53.8937 18.1323 17.4179
temp: 298.150 k
press: 1.00000 atm
elementType: 8 8 7 6 6 6 6 6 6 6 1 1 1 1 1 1 1 1 1 1 1 1 1
symmnumber: 1
zpe: 508452.7 jmol-1
zpe.correction: 0.193659 hartree
zpe.thermalcorrener: 0.204675 hartree
zpe.thermalcorrenthalpy: 0.205619 hartree
zpe.thermalcorrgfe: 0.156727 hartree
zpe.sumelectzpe: -478.905021 hartree
zpe.sumelectthermal: -478.894006 hartree
zpe.sumelectthermalent: -478.893062 hartree
zpe.sumelectthermalfe: -478.941954 hartree
dipole: -1.0220 -0.1954 -2.1181
dipole: 2.3599
quadrupole: -59.2703 -56.0244 -65.0107
quadrupole: -4.0307 -2.7496 -2.7592
quadrupole: 0.8315 4.0774 -4.9089 -4.0307 -2.7496 -2.7592
hfenergy: -479.0986805 hartree
pointgroup: C01 [X(C7H13N1O2)]
dipole: -0.3728328 0.090747 0.8454488 debye
dipolederiv: -0.5112682 -0.2478928 -0.2428237 -0.198031 -0.9673457 -0.375024 -0.1800082 -0.29122 -0.4774195 -0.6095793 0.0359611 0.2943759 -0.1382965 -0.5531107 -0.0875434 0.2459747 -0.2616444 -0.7112343 -0.4506325 0.0516567 -0.0020388 0.0807407 -0.5742812 0.0343403 0.0814203 0.0235119 -0.4383324 0.1388541 -0.0378602 0.0805914 -0.0764723 -0.03036 0.0050282 0.053036 0.0018847 0.3038975 -0.0507686 -0.0466527 -0.001104 -0.029278 0.0473744 -0.0821096 0.0179718 -0.0206004 0.119998 0.1162172 0.1283428 -0.0194919 0.1777077 0.3893205 0.0368315 -0.0597429 0.035274 0.3198923 0.3806169 -0.1959307 -0.0825679 -0.2574687 0.3617566 0.0226278 -0.1535358 0.0272206 0.4205895 0.8622221 0.3724308 -0.2641301 0.4413009 1.1000139 0.4405934 -0.3262373 0.5045765 0.8540383 -0.121229 0.0071123 -0.0646235 0.0144956 0.0285828 -0.0012964 -0.017806 -0.0330473 0.0421837 -0.0259253 -0.0415834 -0.0369845 -0.0172112 -0.1219536 0.0095238 0.0101572 -0.0303146 0.0552311 -0.0100982 -0.003242 0.0408815 -0.0198813 0.0102437 -0.0729948 -0.0575576 -0.0444318 -0.1686519 0.0495044 0.0410428 -0.0391155 0.0365387 -0.0119661 0.0827187 -0.0765965 0.1336394 -0.0460454 0.0355039 0.0661108 0.0537258 0.0389804 0.0857638 -0.0147409 0.0700213 -0.0731618 -0.0057972 0.0002159 -0.0946214 -0.0566505 -0.0648037 -0.0429131 -0.0687799 -0.0924561 -0.1203529 -0.0514865 -0.0687687 -0.069592 0.1115138 -0.0238632 -0.026113 0.0001439 0.1593601 0.1116941 -0.1320771 -0.0561911 0.0432667 0.0030042 0.0145439 -0.0498786 0.087589 0.1145009 -0.0218682 -0.28446 -0.0699668 0.1090477 0.030982 0.151749 -0.0154859 -0.0534619 0.0587889 -0.0622684 0.0559352 0.0903157 -0.0234072 0.0611438 -0.010234 0.0867014 0.0402226 -0.021564 0.0375263 -0.1313894 0.0714348 -0.0773947 -0.0046833 -0.1211731 -0.1398216 0.020429 0.0005743 0.0343102 0.073242 -0.0439313 -0.0744078 -0.0910152 -0.0467924 0.0850628 0.0073035 -0.100608 -0.000094 0.042427 -0.0430475 0.1519953 0.075343 0.106784 -0.0548702 -0.0377422 0.0681412 -0.0605407 0.0652415 0.0923273 -0.0255006 0.0265688 -0.0172871 0.0762501 0.0010031 0.0316273 0.0793447 -0.1324203 0.2241941 -0.0688814 0.1270988 -0.0420484 0.3170299 0.0053381 0.1745385 0.0305619 0.2266376 unknown
polarizability: 97.0783409|1.7993444|92.3071087|-2.4481144|3.0550255|72.5334937 unknown
InChI: InChI=1S/C7H13NO2/c1-5(2)8-4-3-6(8)7(9)10/h5-6,9H,3-4H2,1-2H3
charge 0 multiplicity 1
23 atoms
O  2.178483 1.380515 0.502844
O  2.345976 -0.173942 -1.213338
N  -0.714739 -0.373591 -0.167222
C  0.626026 -0.476507 0.542433
C  0.554178 -2.028795 0.3850
C  -0.965543 -1.847333 0.080683
C  -1.712888 0.600277 0.350483
C  1.779985 0.211151 -0.169728
C  -3.050516 0.37395 -0.382823
C  -1.200282 2.040884 0.155364
H  0.58687 -0.138089 1.59968
H  0.820647 -2.619784 1.273004
H  1.127777 -2.368967 -0.49071
H  -1.38246 -2.390728 -0.783213
H  -1.599563 -2.03243 0.977624
H  -1.877693 0.427973 1.448488
H  -3.818783 1.071848 -0.003634
H  -2.919889 0.544707 -1.466401
H  -3.425837 -0.655572 -0.237994
H  -0.246788 2.211843 0.685165
H  -1.941849 2.764027 0.540766
H  -1.039006 2.240271 -0.919656
H  2.924091 1.809992 0.000486
