program: Gaussian 09
title: 000282395
version: EM64L-G09RevD.01
frameworkgroup: C1[X(C8H18N2)]
method: RPBEPBE
basis: SDD
operation: Freq
keyword: #pfreq=noraman
keyword: PBEPBE/SDD
title: #p freq=noraman PBEPBE/SDD
converged: YES YES NO NO
title: Mulliken charges:
elementType: N N C C C C C C C C H H H H H H H H H H H H H H H H H H
charge: -0.139188 -0.570558 -0.018534 -0.509992 -0.383441 0.281301 -0.441361 -0.708474 -0.710776 -0.715216 0.179777 0.235317 0.226576 0.214683 0.179971 0.204927 0.216917 0.208485 0.216129 0.209379 0.227289 0.209153 0.201815 0.219817 0.202521 0.227585 0.259220 0.276676
chargesum: 0.00000
title: Mulliken charges with hydrogens summed into heavy atoms:
elementType: N N C C C C C C C C
charge: -0.139188 -0.034662 0.161243 -0.048098 0.011213 0.281301 -0.019517 -0.074481 -0.072519 -0.065292
polarizability: 1.14403989e+02 -5.96537025e-01 9.74579820e+01 -4.60453755e-01 -4.85030436e-01 8.73117904e+01
1716.lowfreq: -18.1785 -11.4357 -0.0006 -0.0001 0.0002 0.9681 44.4766 85.4918 96.9987
frequency: 44.3469 85.3594 96.8949 159.4694 187.2427 193.3160 206.8761 232.9754 254.1943 266.9519 297.1092 321.7813 355.3598 395.7319 422.4320 480.5412 519.2346 578.4881 592.5757 756.9146 789.9988 824.1738 893.0594 896.6422 911.0981 916.2520 937.6910 956.0629 995.8202 1003.5945 1013.0242 1062.0926 1070.6586 1074.2014 1099.5842 1136.7837 1175.1879 1198.8075 1219.1598 1227.2422 1232.7260 1236.3177 1253.5507 1275.2164 1301.7257 1338.7181 1362.8458 1369.1655 1374.3968 1392.5250 1452.1524 1459.5181 1464.9137 1467.2177 1473.7451 1477.5879 1486.6371 1491.8619 1497.3584 1637.8456 2891.0677 2899.9610 2938.3042 2972.1514 2975.3545 2980.3669 3025.2093 3038.4528 3046.9279 3065.7858 3067.5598 3071.7547 3076.5324 3083.5240 3089.5483 3119.1948 3460.1862 3587.8767
redmass: 2.6573 2.8817 1.9762 1.7639 1.2318 1.8261 1.5076 1.0417 1.9875 1.2315 2.6861 2.4855 2.4292 2.6092 2.1726 2.5492 2.8057 2.6862 1.4081 2.1522 1.7783 1.9001 1.6795 2.3055 1.4320 1.6114 1.2377 2.5539 1.4951 1.6710 1.4196 2.5540 2.7873 2.3952 1.8904 1.6429 1.3668 1.5724 2.6847 1.2999 1.4222 2.9714 2.2984 1.5173 1.4453 1.3761 1.2337 1.2282 1.5076 1.2118 1.0530 1.0501 1.0904 1.0482 1.0613 1.0642 1.0800 1.0687 1.0831 1.0950 1.0753 1.0757 1.0653 1.0349 1.0347 1.0358 1.0961 1.0907 1.0625 1.0998 1.0994 1.0991 1.0982 1.1003 1.0995 1.1077 1.0449 1.0977
irintensity: 0.2605 1.2052 0.6395 4.6948 8.4042 13.4480 27.5990 0.1028 2.9064 0.1527 5.9200 1.0868 1.2103 0.7936 9.7870 8.9772 11.6505 44.0001 157.8393 2.4757 1.0126 2.7076 1.8739 3.1471 1.1801 1.5466 0.2074 3.4297 1.5702 14.6161 2.5463 10.1404 20.6125 5.0402 7.4984 2.5149 1.0109 2.1086 39.3163 12.4439 4.5919 78.6317 14.7126 4.0909 0.9032 12.2893 29.8275 23.8820 10.3332 18.2117 1.0567 0.4809 6.6081 1.9086 9.1952 6.2008 9.1450 8.4874 8.7919 45.0655 94.4459 73.6202 76.6093 34.1013 40.1735 16.1707 47.4262 30.7371 47.1253 3.3813 4.7566 51.2664 94.9946 5.4488 66.3155 32.6129 1.0585 0.5374
temp: 298.150 k
press: 1.00000 atm
elementType: 7 7 6 6 6 6 6 6 6 6 1 1 1 1 1 1 1 1 1 1 1 1 1 1 1 1 1 1
symmnumber: 1
zpe: 659649.1 jmol-1
zpe.correction: 0.251247 hartree
zpe.thermalcorrener: 0.263788 hartree
zpe.thermalcorrenthalpy: 0.264733 hartree
zpe.thermalcorrgfe: 0.213479 hartree
zpe.sumelectzpe: -424.264473 hartree
zpe.sumelectthermal: -424.251932 hartree
zpe.sumelectthermalent: -424.250988 hartree
zpe.sumelectthermalfe: -424.302241 hartree
dipole: -0.0497 -1.0097 0.8219
dipole: 1.3029
quadrupole: -61.9971 -62.3185 -63.9407
quadrupole: 4.7299 0.8058 -0.7105
quadrupole: 0.7550 0.4336 -1.1886 4.7299 0.8058 -0.7105
hfenergy: -424.5157201 hartree
pointgroup: C01 [X(C8H18N2)]
dipole: 0.033606 -0.4089725 -0.3071879 debye
polarizability: 114.3328388|0.1594699|97.4616091|1.6257801|0.1433228|87.3793137 unknown
InChI: InChI=1S/C8H18N2/c1-8(2,3)10-5-4-7(10)6-9/h7H,4-6,9H2,1-3H3
charge 0 multiplicity 1
28 atoms
N  -0.286237 0.352245 0.321537
N  3.341901 -0.896142 0.043876
C  1.094015 0.083938 -0.243504
C  1.403417 1.61348 -0.149085
C  -0.120404 1.840135 0.113812
C  -1.511119 -0.345851 -0.182459
C  1.973032 -0.852902 0.599962
C  -1.73898 -0.177181 -1.717964
C  -1.379382 -1.852994 0.148127
C  -2.716802 0.248945 0.586555
H  1.081646 -0.267815 -1.303249
H  1.817513 2.084877 -1.052305
H  2.04879 1.850558 0.71147
H  -0.396453 2.451291 0.991806
H  -0.647054 2.241259 -0.779721
H  1.480046 -1.851562 0.675357
H  2.020157 -0.441781 1.624976
H  -0.891147 -0.586789 -2.298109
H  -2.651271 -0.717645 -2.030566
H  -1.868051 0.885305 -1.994979
H  -1.188926 -1.989581 1.227229
H  -0.547031 -2.315731 -0.413742
H  -2.308243 -2.388591 -0.121473
H  -2.830926 1.329073 0.377828
H  -3.655046 -0.254772 0.28979
H  -2.572026 0.122205 1.674019
H  3.400743 -1.317736 -0.888481
H  4.050038 -1.272635 0.679992
