program: Gaussian 09
title: 000282414
version: EM64L-G09RevD.01
frameworkgroup: C1[X(C18H16O2)]
method: RPBEPBE
basis: SDD
operation: Freq
keyword: #pfreq=noraman
keyword: PBEPBE/SDD
title: #p freq=noraman PBEPBE/SDD
converged: YES YES NO NO
title: Mulliken charges:
elementType: O O C C C C C C C C C C C C C C C C C C H H H H H H H H H H H H H H H H
charge: -0.151958 -0.151937 0.171193 0.171201 0.226557 0.226577 0.268419 0.268425 -0.184889 -0.184991 -0.563493 -0.563390 0.467845 0.467846 -0.546466 -0.546587 -0.825072 -0.825071 -0.807736 -0.807729 0.290683 0.290675 0.240361 0.240362 0.229870 0.237337 0.247306 0.247303 0.237336 0.229872 0.240164 0.224376 0.235537 0.240158 0.224373 0.235541
chargesum: 0.00000
title: Mulliken charges with hydrogens summed into heavy atoms:
elementType: O O C C C C C C C C C C C C C C C C C C
charge: -0.151958 -0.151937 0.171193 0.171201 0.226557 0.226577 0.268419 0.268425 -0.184889 -0.184991 -0.272810 -0.272714 0.467845 0.467846 -0.306105 -0.306225 -0.110560 -0.110559 -0.107659 -0.107656
polarizability: 3.01348621e+02 -2.27491256e-03 2.28900391e+02 -3.56413853e+00 6.42367108e-05 1.11436569e+02
1716.lowfreq: -6.6240 -0.0005 -0.0004 0.0006 3.5832 9.0606 43.5744 57.5613 59.5693
frequency: 43.5666 57.5596 59.5373 60.5842 93.1397 114.7734 158.4996 178.6275 191.3403 209.7754 212.9810 229.0285 234.6474 240.7958 267.3807 293.3733 331.4575 342.5272 355.2134 377.8927 378.5024 422.9263 458.4831 485.5936 500.3845 503.0670 525.0618 544.6163 547.8034 562.2709 583.2270 653.5787 656.8386 722.8210 739.0585 770.7259 819.9972 846.7538 885.0147 888.7178 934.2755 939.0973 951.5344 962.5167 969.8039 985.4783 989.3886 1023.8013 1025.9003 1040.9713 1048.1606 1052.1061 1053.4601 1058.6580 1084.9134 1165.1719 1172.9767 1242.2677 1255.0931 1264.6975 1302.9951 1310.6986 1360.5094 1367.6578 1395.5693 1399.3844 1401.0574 1401.1800 1405.5278 1406.6961 1435.1426 1465.0258 1468.3635 1469.1998 1470.6294 1473.0072 1478.1975 1480.8322 1487.7000 1496.0028 1555.6086 1567.9614 1574.4017 1587.0202 1609.3178 1623.0680 2979.0291 2979.1368 2984.5204 2985.5612 3058.8613 3060.2612 3060.2750 3062.1295 3087.9720 3087.9930 3103.6736 3105.0044 3112.3120 3112.3908 3139.9962 3140.4009
redmass: 3.6792 2.0128 1.0639 1.6472 3.5049 5.4469 4.5619 3.8371 2.5967 3.4933 1.0498 2.6451 1.2840 3.1296 4.0360 2.9027 4.0603 7.8639 4.8346 6.2609 4.5330 6.0296 5.1803 3.9767 5.3334 3.6788 3.8105 4.5848 4.5940 4.2216 2.9120 4.6340 4.9052 4.3025 6.2757 6.7683 4.9906 7.3480 1.3477 1.4011 1.3726 1.4868 3.6630 3.7218 1.9116 1.6132 5.0990 1.4961 1.5203 1.6339 1.4990 1.6525 1.5712 2.9101 2.9193 2.4618 1.5249 1.9171 1.4600 2.2278 6.7813 8.2343 7.3782 4.9851 1.2099 1.3733 1.3025 1.2776 3.1429 2.2386 2.7628 1.7637 1.2014 1.1205 1.0628 1.1100 1.1394 1.3056 1.0551 1.3164 5.3106 10.4213 6.8261 8.2458 6.1632 7.7265 1.0382 1.0382 1.0382 1.0380 1.0983 1.0957 1.0957 1.0968 1.0999 1.0999 1.0980 1.0980 1.0913 1.0911 1.0920 1.0920
irintensity: 1.4134 1.6637 0.1192 0.0270 0.0046 0.4749 0.0959 0.0310 6.2771 0.2529 0.0413 1.7405 2.6115 2.5155 0.0930 1.2188 0.0542 4.0869 2.2314 5.4462 0.3708 0.6152 6.5618 2.2671 1.5097 0.5471 3.0734 0.2617 1.7168 3.0379 0.5729 0.5493 3.4845 14.2429 1.1721 11.1653 1.1360 1.8443 27.4394 2.2931 7.5595 0.2329 0.4373 3.5293 11.9916 13.3165 3.6951 22.5354 0.0151 4.0078 0.0446 22.6305 3.0828 18.6409 0.9544 14.5463 15.2819 19.7527 17.3251 2.6994 55.6446 57.5589 9.1526 8.1711 18.1877 16.5423 1.4646 6.3846 14.6247 17.1607 33.3754 11.2644 62.1201 9.9042 16.8809 3.4939 9.2398 2.1458 24.9184 2.9051 68.8476 266.8095 5.1635 45.0679 1.3057 7.7922 67.3922 0.7795 7.2260 38.8403 28.1221 23.9168 15.2400 5.4054 3.5944 25.2591 0.0216 10.9626 29.5242 20.7425 8.0095 0.2685
temp: 298.150 k
press: 1.00000 atm
elementType: 8 8 6 6 6 6 6 6 6 6 6 6 6 6 6 6 6 6 6 6 1 1 1 1 1 1 1 1 1 1 1 1 1 1 1 1
symmnumber: 1
zpe: 746593.5 jmol-1
zpe.correction: 0.284362 hartree
zpe.thermalcorrener: 0.302769 hartree
zpe.thermalcorrenthalpy: 0.303713 hartree
zpe.thermalcorrgfe: 0.238345 hartree
zpe.sumelectzpe: -844.574210 hartree
zpe.sumelectthermal: -844.555803 hartree
zpe.sumelectthermalent: -844.554859 hartree
zpe.sumelectthermalfe: -844.620228 hartree
dipole: -0.0003 -7.5166 -0.0003
dipole: 7.5166
quadrupole: -91.6809 -131.1066 -119.1115
quadrupole: -0.0027 3.2509 -0.0013
quadrupole: 22.2855 -17.1403 -5.1452 -0.0027 3.2509 -0.0013
hfenergy: -844.8585723 hartree
pointgroup: C01 [X(C18H16O2)]
dipole: 0.0000867 2.9572533 0.0004408 debye
polarizability: 301.125362|-0.0027941|228.9003872|7.4197592|0.0222151|111.6598324 unknown
InChI: InChI=1S/C18H16O2/c1-9-5-11(3)15-13(7-9)17(19)18(20)14-8-10(2)6-12(4)16(14)15/h5-8H,1-4H3
charge 0 multiplicity 1
36 atoms
O  -1.180536 -3.088312 -0.812958
O  1.180365 -3.088553 0.811612
C  -0.745615 0.486236 0.044718
C  0.745584 0.486259 -0.04495
C  -1.43967 -0.734081 -0.265109
C  1.439646 -0.73418 0.2644
C  -1.536993 1.595598 0.478272
C  1.53696 1.59581 -0.478013
C  -0.699261 -2.024245 -0.333618
C  0.699251 -2.024385 0.332336
C  -2.847734 -0.781927 -0.364745
C  2.847702 -0.78205 0.364073
C  -3.632174 0.362691 -0.095291
C  3.632141 0.362687 0.095094
C  -2.952894 1.510432 0.375391
C  2.952864 1.510613 -0.375127
C  -0.96717 2.821599 1.177434
C  0.967153 2.822126 -1.176631
C  -5.141051 0.339068 -0.246189
C  5.14102 0.338978 0.245965
H  -3.31155 -1.741249 -0.621046
H  3.31152 -1.74147 0.620006
H  -3.544037 2.375847 0.703336
H  3.544006 2.376177 -0.702676
H  -1.032518 3.732511 0.554314
H  -1.549054 3.017241 2.096698
H  0.085258 2.682994 1.469584
H  -0.085256 2.683639 -1.468903
H  1.549085 3.018216 -2.095768
H  1.032448 3.732745 -0.553077
H  -5.432144 0.443978 -1.309123
H  -5.619489 1.162598 0.311492
H  -5.568046 -0.614024 0.113265
H  5.432101 0.442014 1.309082
H  5.619359 1.163544 -0.310262
H  5.568129 -0.613428 -0.115186
