program: Gaussian 09
title: 000282377
version: EM64L-G09RevD.01
frameworkgroup: C1[X(C12H11NO2)]
method: RPBEPBE
basis: SDD
operation: Freq
keyword: #p
keyword: freq=noraman
keyword: PBEPBE/SDD
title: #p freq=noraman PBEPBE/SDD
converged: NO YES NO NO
title: Mulliken charges:
elementType: O O N C C C C C C C C C C C C H H H H H H H H H H H
charge: -0.434194 -0.269353 -0.261370 0.233560 0.309701 0.434885 -0.503623 -0.353202 -0.661984 -0.413483 -0.257884 -0.224030 -0.247228 -0.320092 0.148531 0.259159 0.229014 0.249306 0.249383 0.238838 0.242797 0.270309 0.224741 0.225682 0.255053 0.375482
chargesum: 0.00000
title: Mulliken charges with hydrogens summed into heavy atoms:
elementType: O O N C C C C C C C C C C C C
charge: -0.058711 -0.269353 -0.261370 0.233560 0.309701 0.434885 -0.244465 -0.124188 0.075543 -0.170685 0.012425 0.000711 -0.021546 -0.065039 0.148531
polarizability: 3.30220576e+02 -4.77096729e+00 1.44821928e+02 4.71279231e-03 2.00478636e-02 6.09174434e+01
1716.lowfreq: -5.7536 -2.6822 -0.0005 0.0004 0.0005 6.2872 40.9251 49.0380 61.9541
frequency: 40.7320 49.0251 61.9506 71.5221 129.0828 151.9403 201.3114 212.9006 259.6179 267.7851 286.0530 348.8644 444.3304 445.6450 504.9199 549.2121 565.9749 568.0604 575.9001 600.0992 631.1209 677.3758 700.1356 741.1036 742.6525 755.2959 815.0882 855.8375 858.9410 874.8785 897.7299 937.7581 941.3827 975.8071 998.5059 1011.3010 1048.8684 1095.0628 1115.1056 1131.2206 1144.4462 1169.5278 1178.3119 1221.7032 1241.3992 1293.0349 1319.9749 1336.5099 1356.1204 1388.6074 1413.6157 1439.2418 1470.4064 1476.0492 1476.7154 1495.4391 1532.5948 1576.4823 1619.6787 1623.3862 1645.4212 2989.9666 3069.3196 3109.8819 3121.2847 3128.5177 3137.4278 3150.4958 3166.3373 3169.4257 3217.4371 3527.2741
redmass: 2.0648 2.9294 2.1520 5.8302 3.0807 3.9205 7.7670 3.1560 4.8604 3.8514 3.6665 3.4452 4.6013 2.9286 5.1059 5.2398 2.4931 1.6188 5.0885 4.9624 2.4257 5.3940 4.9637 5.2183 1.3692 2.8937 1.4702 1.5968 3.5896 1.9229 4.3586 1.3819 4.1114 1.3127 1.1605 2.1658 2.0979 2.6247 1.3079 1.4573 2.2026 1.2670 1.2274 1.4427 1.8745 1.8105 2.0917 2.0918 2.9729 3.2700 3.8532 1.7023 2.0814 1.0472 2.3496 1.3417 6.0784 6.3150 7.9338 7.2227 5.8492 1.0364 1.1024 1.0893 1.0972 1.0849 1.0888 1.0955 1.1003 1.0923 1.0974 1.0640
irintensity: 0.8402 0.9170 0.3913 0.8756 3.3091 0.0035 1.0727 1.5210 3.7039 2.6595 0.2642 0.1448 8.5932 13.2103 37.9781 37.2305 19.0045 65.5871 0.7449 4.3908 68.5049 6.2304 17.8837 0.0264 44.5180 34.8948 45.1086 8.6944 23.6059 13.3013 19.3721 3.7103 5.7845 0.0803 44.1718 2.3295 706.7427 1.5364 0.5987 5.4531 4.0680 25.1177 17.4364 6.2762 5.3289 70.2615 26.5176 10.8867 19.9852 163.7266 34.0375 13.3291 93.9433 13.9351 4.7513 3.2746 50.2254 12.8715 728.0823 8.0904 207.3828 47.0375 20.1762 2.4091 8.1407 0.3297 1.5786 32.5968 41.6217 5.4741 0.7757 65.9844
temp: 298.150 k
press: 1.00000 atm
elementType: 8 8 7 6 6 6 6 6 6 6 6 6 6 6 6 1 1 1 1 1 1 1 1 1 1 1
symmnumber: 1
zpe: 528427.2 jmol-1
zpe.correction: 0.201267 hartree
zpe.thermalcorrener: 0.214659 hartree
zpe.thermalcorrenthalpy: 0.215603 hartree
zpe.thermalcorrgfe: 0.159942 hartree
zpe.sumelectzpe: -668.023164 hartree
zpe.sumelectthermal: -668.009772 hartree
zpe.sumelectthermalent: -668.008828 hartree
zpe.sumelectthermalfe: -668.064490 hartree
dipole: 2.3231 0.8316 -0.0001
dipole: 2.4675
quadrupole: -85.2738 -78.0740 -92.5665
quadrupole: 7.2824 0.0042 -0.0030
quadrupole: 0.0309 7.2308 -7.2617 7.2824 0.0042 -0.0030
hfenergy: -668.2244316 hartree
pointgroup: C01 [X(C12H11N1O2)]
dipole: -0.9079137 0.3436816 0.0002555 debye
dipolederiv: -1.2737575 0.5823414 0.000039 0.8868828 -0.8087832 -0.0001322 0.0000984 -0.0001327 -0.4354196 -1.1832255 -0.1967006 0.0002485 -0.6670937 -0.9045867 0.0002901 0.0004934 0.0002249 -0.3387495 -0.0942745 -0.0556616 0.0001044 -0.3178049 -0.6707373 0.0005172 -0.0003924 -0.0013374 -0.1448232 -0.004772 0.3412026 0.0000409 0.1502145 0.0334075 -0.0000812 0.0000483 0.0002261 0.0468818 -0.2926845 0.1295064 -0.0000934 -0.0737783 -0.2174756 0.0000448 0.0001287 -0.0000223 0.0207747 -1.0695122 -0.2494965 0.0001174 -0.8024128 0.405107 0.0001186 0.0002251 0.0002163 0.0382039 0.4689803 -0.1722699 0.0000044 0.3036986 -0.1415055 0.0000366 -0.0001208 0.0000537 -0.2345772 0.1644084 -0.1860998 -0.0000059 -0.0886404 0.0421963 -0.0001574 -0.000077 -0.0000795 -0.198112 0.1184122 0.1477212 -0.000247 0.136501 0.5171577 -0.0011537 0.0001831 -0.0009297 0.2135532 0.400806 -0.0621196 -0.0000451 0.1475855 0.1187329 -0.0000007 0.000024 0.0000154 -0.1657853 1.6057762 0.0335122 -0.0003584 -0.2064117 0.1030032 -0.0001784 -0.0003012 -0.0001021 -0.0788947 -0.2054537 0.0033646 0.0000478 -0.3491217 0.1728423 0.0000425 0.0000263 -0.0000906 -0.1681911 -0.2281304 0.1351161 0.0000376 0.478117 -0.0842603 -0.0000219 0.000028 0.000007 -0.1806885 -1.9494706 0.0288758 0.0003536 0.4188267 0.0257126 -0.0001451 0.0006132 -0.0001043 -0.1920037 3.0771107 -0.2532005 -0.0006405 0.2665091 1.315311 -0.0003072 -0.0010473 -0.0001756 0.2246396 0.0435182 0.0525104 0.000025 0.0638893 0.0010098 -0.0000453 -0.0000109 -0.0000184 0.182283 0.0863546 -0.0183398 -0.0000019 0.0577123 -0.1132577 0.0000504 0.0000619 0.0001448 0.1712889 0.028559 -0.1129555 -0.0955276 -0.0324911 0.0073227 -0.0049875 -0.0888017 -0.0672581 -0.0453753 0.0305425 -0.1122005 0.0942209 -0.0330958 0.0053844 0.0060805 0.0881383 0.0695176 -0.0477995 -0.0423556 0.1481035 0.0015221 0.0299638 0.0465077 -0.000258 0.0008869 -0.0003616 0.1211511 0.0840297 0.033181 0.0000065 -0.0324627 -0.0989106 -0.0000225 0.0000069 -0.0000364 0.1613714 0.1101845 -0.0289822 -0.000008 -0.0375651 -0.0283026 0.000123 -0.000291 0.0000983 0.1510547 -0.1126678 0.0823048 0.0000157 0.0862885 0.0483345 0.0000018 -0.0000146 -0.0000021 0.1616026 -0.1049518 -0.1045946 0.0000125 -0.1113291 0.0191931 0.0000002 -0.0000171 0.0000119 0.1667912 0.0544713 -0.055624 0.0000479 -0.0705981 -0.0299197 0.0000874 0.0000433 0.0000558 0.1749929 0.2881023 -0.1094948 0.0000838 -0.2033837 0.2365167 0.0000978 0.000068 0.0000789 0.3958307 unknown
polarizability: 330.3325109|1.4126458|144.7099885|-0.0471432|-0.0133983|60.9174488 unknown
InChI: InChI=1S/C12H11NO2/c1-13-10(6-7-12(14)15)8-9-4-2-3-5-11(9)13/h2-8,14H,1H3
charge 0 multiplicity 1
26 atoms
O  5.082303 -1.349509 0.001951
O  4.670227 0.945856 0.001516
N  -0.55025 1.089596 0.003526
C  -1.837444 0.544589 0.003478
C  -1.708822 -0.896747 0.00325
C  0.396168 0.029334 0.003123
C  -0.307775 -1.194231 0.002993
C  -3.102817 1.178551 0.003516
C  -0.222685 2.518608 0.00337
C  -2.883571 -1.701746 0.003266
C  1.815188 0.292232 0.002659
C  -4.244659 0.355163 0.003536
C  -4.138086 -1.071171 0.003444
C  2.814242 -0.651675 0.002593
C  4.220115 -0.231828 0.002013
H  0.147427 -2.18344 0.002733
H  -3.208547 2.268476 0.003299
H  0.362304 2.795308 0.898771
H  0.351177 2.798189 -0.89839
H  -1.154675 3.103117 0.010318
H  -2.805992 -2.794434 0.003129
H  2.147133 1.340119 0.002146
H  -5.238286 0.816977 0.003524
H  -5.053159 -1.673262 0.003444
H  2.615344 -1.726975 0.002964
H  6.021339 -1.020597 0.001527
