program: Gaussian 09
title: 000282388
version: EM64L-G09RevD.01
frameworkgroup: C1[X(C18H15N3)]
method: RPBEPBE
basis: SDD
operation: Freq
keyword: #pfreq=noraman
keyword: PBEPBE/SDD
title: #p freq=noraman PBEPBE/SDD
converged: NO YES NO NO
title: Mulliken charges:
elementType: N N N C C C C C C C C C C C C C C C C C C H H H H H H H H H H H H H H H
charge: -0.223294 -0.075122 -0.020947 0.292573 -0.172753 -0.559012 0.198136 0.368445 -0.354574 -0.091587 0.481732 -0.328040 -0.777258 -0.336963 -0.427817 -0.372500 -0.185544 -0.378778 -0.216449 -0.223699 -0.240427 0.240121 0.237565 0.236831 0.257718 0.269798 0.227412 0.250721 0.277732 0.230345 0.255770 0.226624 0.236943 0.230248 0.232720 0.233328
chargesum: 0.00000
title: Mulliken charges with hydrogens summed into heavy atoms:
elementType: N N N C C C C C C C C C C C C C C C C C C
charge: -0.223294 -0.075122 -0.020947 0.292573 -0.172753 -0.081325 0.198136 0.368445 -0.117743 -0.091587 0.481732 -0.070322 -0.029326 -0.059231 -0.197472 -0.116731 0.041080 -0.141835 0.013799 0.009021 -0.007098
polarizability: 3.29748496e+02 -2.15040616e+01 1.79738829e+02 2.57717843e+01 5.94782979e+00 1.45974635e+02
1716.lowfreq: -15.0232 -8.6588 -4.4557 -0.0009 -0.0007 -0.0005 9.8062 19.2518 36.0226
frequency: -4.3080 18.8169 36.0114 95.8575 102.7988 131.7780 158.0429 175.3054 192.2405 220.2256 243.9671 289.7584 299.6179 342.1417 382.6308 401.5921 411.2867 427.2041 458.1000 507.5229 522.1924 552.9776 568.3117 577.1242 591.9390 614.4443 642.5515 655.2223 700.6815 717.2959 721.5014 743.7508 759.5793 784.2913 797.4926 823.8930 825.1370 838.8512 853.9022 874.3957 908.5205 941.0126 952.7028 960.1259 978.6155 990.0595 993.2976 995.5408 999.5196 1014.3354 1026.9598 1041.1127 1047.2255 1059.0114 1087.5854 1133.7444 1155.0427 1174.0239 1189.8231 1196.2214 1212.1211 1227.8679 1234.6658 1250.3743 1303.5017 1334.6997 1341.5490 1345.7075 1363.8804 1378.1982 1388.1067 1396.5800 1403.4088 1425.5915 1439.8360 1443.4790 1458.3530 1467.2663 1476.5630 1486.7481 1505.9004 1518.0466 1568.6522 1581.8676 1596.7964 1615.3318 1624.5337 2980.3724 2995.9837 3044.8488 3055.6741 3116.8385 3120.8636 3124.1127 3130.1736 3137.0944 3140.8115 3148.8929 3151.7230 3168.1530 3170.2777 3172.5117
redmass: 3.7547 5.2207 5.0557 3.6420 5.2573 1.1128 4.7999 3.5179 3.5108 4.3975 5.0494 2.2517 4.8739 4.6640 3.5694 2.8082 6.4855 3.7817 3.0578 6.3513 4.3460 5.1065 3.6507 4.1360 5.1820 6.3006 6.7459 5.1816 2.6721 2.5483 2.7900 2.1654 5.9723 1.7826 3.7546 3.8358 1.5192 3.7093 1.2519 4.5903 1.4512 1.4225 2.4307 1.3380 1.3887 6.2534 1.3615 1.9181 1.3910 3.1576 2.2237 2.3573 1.4952 2.6451 1.5858 1.1936 1.8712 1.0551 1.1234 2.6693 2.4609 1.5561 2.3599 2.7579 1.5255 2.3132 4.0123 1.7314 2.5332 2.4403 4.2596 1.3559 2.5051 3.1863 3.4351 2.2602 1.2590 1.0569 1.3253 1.8081 4.3230 5.3572 6.1789 8.0863 6.0960 5.9743 8.1757 1.0400 1.0598 1.1022 1.0968 1.0880 1.0892 1.0966 1.0861 1.0892 1.0912 1.0898 1.0960 1.1015 1.0998 1.0956
irintensity: 0.0257 0.2193 0.1918 0.3257 2.0004 0.5295 1.0797 8.6534 5.1415 0.3825 0.0796 3.3003 0.2131 0.5978 4.3522 0.2256 1.1560 0.8143 7.4104 2.5012 0.0320 4.0495 9.1609 7.6847 1.1005 0.2875 5.3279 2.7419 12.9426 47.3900 18.8364 25.0094 5.3181 4.9087 4.1620 6.0871 92.8685 0.2453 0.4045 0.6273 1.2223 0.0401 16.7670 1.0010 0.0609 0.6321 1.3829 1.8605 0.1776 4.7017 8.5480 4.0190 4.9968 10.5869 5.8300 0.8030 18.5095 0.1958 5.9909 7.0157 5.0232 4.0696 1.4378 9.3670 24.9695 25.6132 5.2497 43.8207 41.3885 90.6291 2.8355 15.6857 2.5241 19.3519 23.2405 4.7378 10.9052 9.8195 25.3819 11.3114 8.3160 69.3456 11.7798 31.4410 0.6246 7.0792 3.4247 28.9883 27.4870 9.7424 13.1822 9.0071 24.9600 5.5202 1.0008 9.5563 10.0698 12.9512 32.2484 23.5977 27.4899 6.4222
temp: 298.150 k
press: 1.00000 atm
elementType: 7 7 7 6 6 6 6 6 6 6 6 6 6 6 6 6 6 6 6 6 6 1 1 1 1 1 1 1 1 1 1 1 1 1 1 1
symmnumber: 1
zpe: 747384.1 jmol-1
zpe.correction: 0.284664 hartree
zpe.thermalcorrener: 0.300356 hartree
zpe.thermalcorrenthalpy: 0.301301 hartree
zpe.thermalcorrgfe: 0.240620 hartree
zpe.sumelectzpe: -857.755952 hartree
zpe.sumelectthermal: -857.740260 hartree
zpe.sumelectthermalent: -857.739315 hartree
zpe.sumelectthermalfe: -857.799996 hartree
dipole: -5.0261 0.8735 -0.7488
dipole: 5.1561
quadrupole: -110.4564 -124.1560 -117.4271
quadrupole: 3.8604 7.4531 -2.9088
quadrupole: 6.8901 -6.8095 -0.0806 3.8604 7.4531 -2.9088
hfenergy: -858.040616 hartree
pointgroup: C01 [X(C18H15N3)]
dipole: -1.9671197 0.4502565 -0.2069228 debye
polarizability: 328.6725912|-29.8382084|179.9033094|19.2642772|9.5769064|146.8860594 unknown
InChI: InChI=1S/C18H15N3/c1-13-20-18-15-8-5-11-19-16(15)9-10-17(18)21(13)12-14-6-3-2-4-7-14/h2-11H,12H2,1H3
charge 0 multiplicity 1
36 atoms
N  -0.730937 0.827207 -0.732649
N  0.846648 1.916639 0.513147
N  4.255763 -1.661341 -0.444711
C  0.430707 0.037055 -0.794004
C  1.397331 0.7325 -0.015962
C  -2.026004 0.52481 -1.359634
C  -0.428327 1.943506 0.071044
C  2.71654 0.200014 0.137679
C  0.70792 -1.197824 -1.445303
C  3.007528 -1.057049 -0.527826
C  -3.074333 -0.039819 -0.397681
C  1.992582 -1.725506 -1.303723
C  -1.421681 3.021583 0.375295
C  3.753834 0.821628 0.894698
C  -4.4427 0.269679 -0.590733
C  -2.704466 -0.904001 0.662735
C  5.00478 0.200436 0.967723
C  5.207599 -1.03836 0.282394
C  -5.430939 -0.283708 0.255048
C  -3.691043 -1.453504 1.51098
C  -5.057199 -1.148323 1.30859
H  -1.834358 -0.197589 -2.175541
H  -2.414594 1.441617 -1.840411
H  -0.049485 -1.727541 -2.032886
H  2.274175 -2.6710 -1.776324
H  -0.948579 3.745651 1.054969
H  -1.740483 3.561082 -0.53728
H  -2.329951 2.618694 0.85985
H  3.547478 1.769544 1.401207
H  -4.738934 0.946607 -1.402104
H  -1.647786 -1.140753 0.829987
H  5.826081 0.64493 1.538455
H  6.181612 -1.54093 0.327683
H  -6.486082 -0.035158 0.096584
H  -3.394521 -2.118442 2.329553
H  -5.820575 -1.575331 1.967953
