program: Gaussian 09
title: 000282401
version: EM64L-G09RevD.01
frameworkgroup: C1[X(C21H20N2O)]
method: RPBEPBE
basis: SDD
operation: Freq
keyword: #p
keyword: freq=noraman
keyword: PBEPBE/SDD
title: #p freq=noraman PBEPBE/SDD
converged: YES YES NO NO
title: Mulliken charges:
elementType: O N N C C C C C C C C C C C C C C C C C C C C C H H H H H H H H H H H H H H H H H H H H
charge: -0.295011 -0.262590 -0.472687 -0.266892 -0.595396 0.258156 0.228867 0.243260 0.108183 0.180981 0.226067 -0.396177 0.147415 -0.336351 -0.421400 -0.791664 -0.252221 -0.223125 -0.356143 -0.257955 -0.254450 -0.221748 -0.124530 -0.747522 0.243697 0.238867 0.251198 0.301517 0.238900 0.313543 0.227976 0.264425 0.212875 0.269389 0.224359 0.229437 0.225188 0.220556 0.250071 0.222222 0.255385 0.230448 0.230237 0.232643
chargesum: 0.00000
title: Mulliken charges with hydrogens summed into heavy atoms:
elementType: O N N C C C C C C C C C C C C C C C C C C C C C
charge: -0.295011 -0.262590 -0.171171 -0.023194 -0.105331 0.258156 0.228867 0.243260 0.108183 0.180981 0.226067 -0.157277 0.147415 -0.022808 -0.193424 -0.044975 -0.027862 0.002063 -0.126706 -0.037399 -0.004379 0.000474 0.130855 -0.054194
polarizability: 3.36280341e+02 -2.62176423e+01 2.37227353e+02 2.70555567e+01 1.28075829e+01 1.86613892e+02
1716.lowfreq: -10.6947 -5.4637 -0.0001 0.0004 0.0006 3.5271 10.9000 26.6371 40.8479
frequency: 5.6810 26.6284 40.8440 51.0416 78.6505 90.5481 96.6193 119.3822 124.8168 132.3425 163.1725 196.7296 200.8075 205.7052 221.3512 236.1514 280.9554 295.3405 305.6636 346.2840 378.4555 394.5817 421.4042 428.7055 431.1657 480.0679 485.2840 517.5295 531.4263 540.2178 578.2471 585.7950 601.5050 615.0123 659.1297 663.9962 676.0630 698.3848 739.2561 746.5029 747.8199 763.8292 766.6996 770.0819 829.3340 836.7607 848.1650 856.5499 878.9612 893.7969 923.4778 927.2403 943.1972 966.9654 968.4858 980.0262 980.3462 991.0100 995.8973 1010.5734 1017.0172 1024.0520 1038.0283 1055.1159 1070.6146 1096.0673 1110.5399 1118.3235 1141.3119 1166.2075 1166.6395 1171.2074 1189.4748 1219.0388 1231.6704 1241.0024 1246.8636 1270.4445 1286.4191 1300.2170 1306.7509 1309.3839 1312.2895 1358.3970 1368.8123 1394.5336 1402.8264 1405.1474 1414.2699 1426.7789 1448.5582 1458.6960 1460.4356 1464.6007 1466.4878 1467.6307 1476.0617 1481.1711 1482.0804 1543.4063 1574.6595 1589.9243 1600.2468 1612.2560 1631.8301 1664.4972 2965.9031 2980.3654 2990.1976 3009.3009 3037.4489 3058.9508 3061.4720 3080.9777 3091.9527 3109.0104 3120.1577 3124.8759 3128.7140 3136.8845 3142.8996 3152.8588 3159.5661 3162.3128 3205.9506 3599.6619
redmass: 4.5409 4.3294 4.1638 4.1040 1.7021 1.7563 3.2346 1.9667 3.2284 3.6356 3.3936 1.6127 3.0670 3.2266 3.2182 4.8643 3.1933 4.3487 4.4968 5.3659 5.5742 6.6817 3.6791 3.1054 2.9177 3.8853 5.2604 3.4656 1.2768 3.4851 3.8387 4.8592 5.8534 6.0922 5.0804 3.7826 3.8589 3.0865 3.0438 4.9645 1.4051 3.7789 1.5188 4.5796 4.5703 1.9800 1.4871 4.7663 1.3060 2.6373 3.4548 1.3862 1.5035 1.9615 1.3360 1.6469 1.3818 1.3085 1.8514 2.3203 2.3115 2.1264 1.5138 1.5903 3.7322 2.5112 1.8367 2.2448 1.4889 1.1710 1.1155 1.6922 1.7568 2.1218 1.7439 1.4445 1.7833 1.6577 1.4800 1.8646 2.2699 1.5930 1.6020 1.7386 2.9370 1.2405 4.6310 2.1808 1.9317 2.3629 2.4330 1.0479 1.2397 1.1032 1.1256 3.5668 2.4999 1.5882 1.7062 8.6513 6.9688 6.1941 7.5276 7.1884 6.7381 5.7369 1.0371 1.0389 1.0692 1.0805 1.0957 1.0977 1.0995 1.0974 1.0976 1.0921 1.0858 1.0863 1.0884 1.0913 1.0947 1.0908 1.0986 1.1000 1.0947 1.0804
irintensity: 0.7373 0.2956 0.5175 4.1403 0.2258 0.6084 1.1712 1.0610 1.0145 1.9849 1.4253 0.1957 1.1330 0.2867 5.2389 2.7109 1.2135 2.5801 1.9851 1.2434 1.6782 2.5662 3.1866 6.0728 5.4808 5.4629 0.3833 2.4882 69.5503 1.1846 4.0569 15.3104 13.2347 1.9380 2.2370 4.2234 4.5718 4.5487 4.2030 15.3157 82.4265 13.3747 69.9084 7.1969 4.4032 4.4574 0.0700 0.3448 4.3707 37.3581 16.6599 2.2834 0.7755 15.1979 2.3891 22.8769 33.0297 1.6908 3.4657 12.2592 4.5985 9.9665 6.7698 0.3153 15.6634 16.4023 1.8743 8.9084 10.8523 2.7070 2.8799 11.4284 4.3657 32.6768 22.2871 17.1633 8.5618 47.8868 31.4419 21.6465 13.3542 62.3434 16.1661 21.5041 165.9042 11.0086 65.5986 16.7016 32.9954 49.5741 41.0820 13.0977 21.5957 16.1016 48.4515 84.5411 95.3327 9.9846 11.7674 145.6050 10.0549 9.3166 2.1880 20.0610 2.1631 81.4932 28.5369 26.8914 12.9531 26.3544 18.1324 16.6873 15.8072 12.2987 6.5284 10.8013 6.7508 1.8136 2.1773 20.8714 34.9074 10.0787 41.9412 31.4612 5.0136 47.8283
temp: 298.150 k
press: 1.00000 atm
elementType: 8 7 7 6 6 6 6 6 6 6 6 6 6 6 6 6 6 6 6 6 6 6 6 6 1 1 1 1 1 1 1 1 1 1 1 1 1 1 1 1 1 1 1 1
symmnumber: 1
zpe: 932322.3 jmol-1
zpe.correction: 0.355103 hartree
zpe.thermalcorrener: 0.376409 hartree
zpe.thermalcorrenthalpy: 0.377354 hartree
zpe.thermalcorrgfe: 0.302521 hartree
zpe.sumelectzpe: -995.299830 hartree
zpe.sumelectthermal: -995.278523 hartree
zpe.sumelectthermalent: -995.277579 hartree
zpe.sumelectthermalfe: -995.352411 hartree
dipole: -2.9807 -2.2072 1.1854
dipole: 3.8937
quadrupole: -137.8044 -139.8650 -127.3044
quadrupole: -10.7030 -3.6808 -3.4188
quadrupole: -2.8131 -4.8738 7.6869 -10.7030 -3.6808 -3.4188
hfenergy: -995.6549324 hartree
pointgroup: C01 [X(C21H20N2O1)]
dipole: 1.098363 1.0392419 0.2456329 debye
polarizability: 339.9025859|-23.1144307|224.9923184|-21.2328097|-23.5992246|195.2266813 unknown
InChI: InChI=1S/C21H20N2O/c1-3-8-20(24)23-18-12-7-4-9-15(18)13-19(23)21-14(2)22-17-11-6-5-10-16(17)21/h3-12,19,22H,13H2,1-2H3
charge 0 multiplicity 1
44 atoms
O  -1.78567 -2.673143 1.041341
N  -1.258292 -0.768039 -0.199156
N  1.944118 1.685968 1.637156
C  -0.291945 0.125367 -0.948088
C  -1.218972 1.191711 -1.638946
C  0.787092 0.726393 -0.072231
C  -2.581696 0.974762 -1.006421
C  -2.566985 -0.196813 -0.203626
C  2.155201 0.951818 -0.508155
C  0.68548 1.19263 1.246355
C  2.863026 1.554865 0.591234
C  -3.758265 1.728071 -1.146434
C  -0.916155 -1.988716 0.403247
C  -3.735447 -0.642333 0.459162
C  2.857625 0.699449 -1.71766
C  -0.462667 1.194295 2.219184
C  -4.936524 1.300154 -0.482477
C  -4.915631 0.125164 0.305301
C  4.22754 1.905266 0.514934
C  4.221879 1.043258 -1.799539
C  0.495894 -2.44745 0.251618
C  4.900209 1.640396 -0.696505
C  0.881549 -3.654713 0.750717
C  2.272164 -4.225101 0.660769
H  0.205166 -0.480543 -1.728226
H  -1.26238 1.023199 -2.731621
H  -0.824964 2.209308 -1.476679
H  2.145896 2.069213 2.558598
H  -3.767229 2.632412 -1.765854
H  -3.709345 -1.551786 1.059773
H  2.35201 0.251449 -2.581342
H  -0.60221 0.201099 2.686291
H  -0.29891 1.928148 3.029666
H  -1.411954 1.451047 1.72158
H  -5.8624 1.876854 -0.583359
H  4.752001 2.365142 1.360137
H  -5.830427 -0.204598 0.810833
H  4.774507 0.85353 -2.726471
H  1.225939 -1.802922 -0.247679
H  5.960529 1.898844 -0.792716
H  0.111448 -4.253895 1.259357
H  2.266089 -5.190679 0.117351
H  2.673183 -4.440422 1.670818
H  2.970023 -3.54065 0.148366
