program: Gaussian 09
title: 000282425
version: EM64L-G09RevD.01
frameworkgroup: C1[X(C27H24O)]
method: RPBEPBE
basis: SDD
operation: Freq
keyword: #pfreq=noraman
keyword: PBEPBE/SDD
title: #p freq=noraman PBEPBE/SDD
converged: YES YES NO NO
title: Mulliken charges:
elementType: O C C C C C C C C C C C C C C C C C C C C C C C C C C C H H H H H H H H H H H H H H H H H H H H H H H H
charge: -0.212085 -0.081812 -0.340693 -0.507040 0.134220 -0.576821 0.264662 -0.585885 0.384830 0.163903 -0.398150 0.136838 0.410364 0.224146 -0.405983 -0.505697 -0.382065 0.406078 -0.262502 -0.444386 -0.380557 -0.481455 -0.777877 -0.274371 -0.250047 -0.441623 -0.277851 -0.245960 0.269359 0.200175 0.239883 0.249891 0.227919 0.223930 0.267204 0.232972 0.234264 0.255742 0.236369 0.253054 0.225669 0.238350 0.238013 0.238775 0.234580 0.255830 0.238724 0.226703 0.227684 0.237825 0.226174 0.228731
chargesum: 0.00000
title: Mulliken charges with hydrogens summed into heavy atoms:
elementType: O C C C C C C C C C C C C C C C C C C C C C C C C C C C
charge: -0.212085 0.187547 -0.140518 -0.017266 0.134220 -0.124973 0.264662 -0.085709 0.384830 0.163903 -0.163886 0.136838 0.410364 0.224146 -0.150241 -0.269328 -0.129010 0.406078 -0.036833 -0.206036 -0.142544 -0.242680 -0.048743 -0.047668 -0.022363 -0.203797 -0.051678 -0.017229
polarizability: 3.45156478e+02 1.14729921e+00 2.86979728e+02 2.88975619e+01 1.61824018e+01 2.50538517e+02
1716.lowfreq: -8.7794 -0.0004 0.0004 0.0005 3.8513 10.7214 27.6601 30.3589 40.6724
frequency: 27.5557 30.3275 40.6383 42.9235 50.0695 59.5891 80.4070 100.9223 123.4465 138.0895 156.6094 166.9294 181.3442 196.4192 216.3069 231.0133 249.1597 284.9088 317.8108 327.3293 380.4110 405.2861 415.9790 418.1352 438.8394 457.8365 470.0910 474.7907 483.5441 500.1117 507.2878 510.9415 525.1237 542.7650 556.4323 577.0945 606.9811 625.7565 646.9566 661.3640 667.1995 687.4172 730.4335 744.4030 754.6790 763.5189 784.6618 788.3567 793.1132 808.9660 813.6702 818.1051 829.0204 848.0887 856.2082 871.6248 878.4214 886.9868 897.2809 929.5118 947.2830 954.4961 958.7837 959.9054 977.1369 981.4486 988.2433 990.9159 993.9960 1000.8887 1007.9827 1012.9774 1034.4619 1035.1807 1079.9875 1088.3139 1096.0070 1125.7419 1148.5847 1152.6586 1161.2913 1164.8248 1172.8836 1174.9333 1177.8661 1182.5927 1201.5969 1205.2401 1225.1016 1229.2994 1234.5115 1235.8831 1255.2504 1268.6441 1279.5671 1283.9200 1302.2083 1317.2788 1343.0165 1352.8017 1362.5847 1368.8465 1373.3968 1377.5968 1404.7841 1406.6124 1415.6282 1422.7293 1427.8989 1430.2262 1440.2761 1442.3390 1454.4881 1454.8500 1459.7212 1473.1487 1481.7307 1515.4440 1516.1790 1579.9881 1588.4030 1598.9397 1606.3753 1630.8440 1631.7638 1632.6836 2941.3895 2949.9132 2964.6348 2978.9017 2997.4056 3008.5117 3013.5399 3028.8932 3064.6470 3065.5542 3109.1814 3118.6664 3119.0980 3119.7447 3121.9322 3130.8253 3132.1978 3135.9353 3137.3275 3147.5316 3150.8585 3155.9648 3163.1806 3164.9894
redmass: 5.0288 5.3654 4.5166 3.7473 4.5831 4.0111 1.2337 2.4018 4.3753 4.0006 5.0233 5.4114 4.1608 4.1935 3.6485 3.0819 4.2249 3.2324 3.1196 2.4994 4.2715 3.8659 3.3637 3.2947 3.6918 2.2694 3.2193 3.3036 4.8377 3.8870 4.4388 5.0675 6.4483 3.9297 3.5708 3.9926 3.5731 4.3228 3.6738 4.1904 3.3750 5.3348 3.2914 1.3140 1.3873 3.1296 4.1953 2.1695 2.1579 2.0865 2.6148 2.2764 1.6775 2.2065 3.0123 2.9915 1.8146 2.0654 2.3105 1.4432 1.9503 1.7102 1.7588 1.4474 1.4181 2.3574 1.4031 1.3579 1.4437 2.2675 2.3219 2.6593 2.2666 2.2764 2.2192 2.4075 2.0325 2.2088 1.4382 1.4272 1.2763 1.4344 1.2647 1.1751 1.4145 1.2496 1.7028 1.6082 1.4712 1.7779 2.0490 1.9799 1.5885 1.5964 1.5561 1.3940 1.7024 1.6998 1.5907 1.5702 2.3057 1.2387 1.5189 1.9823 2.9952 3.1769 5.0234 3.3099 3.3011 1.1363 2.4961 1.0679 2.2327 1.1048 1.3935 1.6689 1.0903 3.5627 3.7125 7.7212 7.5834 5.2465 5.8059 6.5801 6.5525 7.5978 1.0668 1.0662 1.0812 1.0380 1.0751 1.0882 1.0804 1.0859 1.0952 1.1004 1.0862 1.1005 1.0864 1.0864 1.0858 1.0878 1.0890 1.0912 1.0971 1.0939 1.0943 1.0988 1.1001 1.0993
irintensity: 0.4275 0.9381 3.0991 1.2570 0.1515 0.5472 0.2606 0.2800 1.5757 0.6350 0.6454 5.1950 2.3513 0.1516 0.6368 0.7742 1.1351 3.5078 3.1516 0.7803 1.8984 2.7585 2.3885 5.6856 3.2292 5.4263 4.8482 3.5425 6.9122 2.9326 3.4525 2.3259 1.6507 6.5055 1.2943 0.8370 2.6420 2.7782 6.3941 1.3403 3.9645 0.8089 4.8932 7.1169 29.5999 4.7260 3.4143 40.3481 14.0396 31.1521 22.9532 14.4159 42.9270 20.7617 1.1274 3.1712 4.7978 7.4845 6.6418 0.9850 7.0660 2.6220 6.1265 1.3111 1.2634 2.8206 0.4092 0.5450 1.8924 2.3586 5.0386 0.9105 8.1192 7.0207 6.2264 2.8584 1.6594 17.5298 0.1515 9.6587 1.6704 6.4663 16.0994 7.3447 22.0874 3.6055 7.8523 0.4533 1.3647 7.6062 0.9544 5.8014 4.7256 18.0054 21.0299 0.9983 51.4284 5.3637 22.3261 10.1123 1.1472 63.5921 24.5629 12.3687 5.7574 2.8205 5.0713 13.4630 0.6283 16.3978 5.4733 19.4554 1.9424 12.0656 9.7969 5.0064 16.4068 13.9762 9.3547 2.6186 3.2373 7.2454 4.7927 1.5766 0.9691 91.5898 17.3802 37.7522 19.5119 3.9350 7.3781 4.8247 32.1231 36.4227 13.0024 26.4690 7.9110 16.3565 2.7697 2.2445 1.8595 3.3320 5.0152 16.8860 37.6249 46.7452 36.8502 31.9411 25.0148 23.4624
temp: 298.150 k
press: 1.00000 atm
elementType: 8 6 6 6 6 6 6 6 6 6 6 6 6 6 6 6 6 6 6 6 6 6 6 6 6 6 6 6 1 1 1 1 1 1 1 1 1 1 1 1 1 1 1 1 1 1 1 1 1 1 1 1
symmnumber: 1
zpe: 1119113.7 jmol-1
zpe.correction: 0.426248 hartree
zpe.thermalcorrener: 0.449378 hartree
zpe.thermalcorrenthalpy: 0.450322 hartree
zpe.thermalcorrgfe: 0.372682 hartree
zpe.sumelectzpe: -1116.589747 hartree
zpe.sumelectthermal: -1116.566617 hartree
zpe.sumelectthermalent: -1116.565673 hartree
zpe.sumelectthermalfe: -1116.643313 hartree
dipole: 2.0204 -0.4240 -1.2066
dipole: 2.3912
quadrupole: -153.1479 -164.1232 -155.0698
quadrupole: 13.4866 5.6615 -6.4688
quadrupole: 4.2991 -6.6763 2.3772 13.4866 5.6615 -6.4688
hfenergy: -1117.015995 hartree
pointgroup: C01 [X(C27H24O1)]
dipole: -0.7954887 -0.1800398 0.4688648 debye
polarizability: 345.3233876|-3.5501215|288.6683763|28.15396|-14.5779432|248.6829596 unknown
InChI: InChI=1S/C27H24O/c1-18(28)17-22-16-15-21-14-13-20-8-3-5-11-24(20)26(21)27(22)25-12-6-9-19-7-2-4-10-23(19)25/h2-14,22,27H,15-17H2,1H3
charge 0 multiplicity 1
52 atoms
O  1.264719 4.649903 0.268291
C  0.386198 1.921898 -0.123587
C  0.023324 0.420361 0.145232
C  -0.073732 2.320238 -1.544289
C  -1.445529 0.119164 -0.182919
C  -1.60265 2.196651 -1.696639
C  -2.189098 0.949061 -1.042483
C  -0.208597 2.827482 0.979938
C  1.012326 -0.518066 -0.571267
C  -2.080279 -1.042659 0.413064
C  -3.568908 0.650187 -1.309069
C  2.336484 -0.737956 -0.02188
C  -3.475885 -1.320892 0.138746
C  0.268199 4.282954 0.947149
C  0.667291 -1.148148 -1.77373
C  -4.201122 -0.446832 -0.736563
C  -1.377131 -1.950041 1.277211
C  3.264121 -1.601268 -0.731813
C  1.583573 -1.991597 -2.472897
C  -4.108066 -2.459169 0.737935
C  2.785476 -0.141572 1.206826
C  2.860925 -2.215819 -1.962547
C  -0.524854 5.273134 1.794717
C  -2.016483 -3.054254 1.848287
C  -3.396546 -3.313401 1.582365
C  4.57361 -1.829015 -0.191831
C  4.066241 -0.382726 1.710081
C  4.9731 -1.234218 1.005546
H  1.486123 2.02881 -0.082455
H  0.146043 0.259151 1.235974
H  0.428581 1.65141 -2.267962
H  0.257213 3.348188 -1.773469
H  -1.876509 2.208344 -2.770077
H  -2.101222 3.088158 -1.259855
H  -1.316324 2.806596 0.980041
H  0.079969 2.433173 1.980767
H  -4.124361 1.314379 -1.983423
H  -0.338351 -1.000849 -2.181594
H  -5.255672 -0.660081 -0.948777
H  -0.31426 -1.791299 1.481491
H  1.271028 -2.46361 -3.410794
H  -5.165914 -2.648656 0.518207
H  2.115507 0.519966 1.765056
H  3.57056 -2.864397 -2.489994
H  -0.828204 4.828952 2.7601
H  0.062975 6.18868 1.965264
H  -1.454719 5.548929 1.258842
H  -1.454343 -3.731731 2.500674
H  -3.886608 -4.181754 2.036268
H  5.259998 -2.484333 -0.741837
H  4.381856 0.085158 2.649175
H  5.975823 -1.41478 1.408002
