program: Gaussian 09
title: 000282385
version: EM64L-G09RevD.01
frameworkgroup: C1[X(C24H18ClNO)]
method: RPBEPBE
basis: SDD
operation: Freq
keyword: #p
keyword: freq=noraman
keyword: PBEPBE/SDD
title: #p freq=noraman PBEPBE/SDD
converged: YES YES NO NO
title: Mulliken charges:
elementType: Cl O N C C C C C C C C C C C C C C C C C C C C C C C C H H H H H H H H H H H H H H H H H H
charge: -0.061411 -0.280951 -0.302275 -0.399722 0.143943 -0.185124 0.168448 0.199024 0.450859 0.415506 0.347491 -0.402341 -0.462759 -0.388694 -0.377567 -0.376320 -0.446247 -0.396180 -0.362252 -0.268128 -0.251334 -0.245683 -0.235433 -0.238018 -0.201164 -0.216453 -0.105871 0.253541 0.264232 0.275791 0.250135 0.241325 0.247604 0.262015 0.243691 0.240965 0.280298 0.268021 0.226941 0.228858 0.227990 0.226568 0.229554 0.255552 0.255576
chargesum: 0.00000
title: Mulliken charges with hydrogens summed into heavy atoms:
elementType: Cl O N C C C C C C C C C C C C C C C C C C C C C C C C
charge: -0.061411 -0.280951 -0.026483 -0.146181 0.143943 0.079107 0.168448 0.199024 0.450859 0.415506 0.347491 -0.152206 -0.221434 -0.141090 -0.115553 -0.132629 -0.205282 -0.115882 -0.094231 -0.041187 -0.022476 -0.017693 -0.008865 -0.008464 0.054388 0.039123 -0.105871
polarizability: 3.92830811e+02 6.76283552e+00 2.79494992e+02 2.50630604e+00 -3.33568019e+01 1.74772608e+02
1716.lowfreq: -3.5103 0.0010 0.0012 0.0021 0.3835 7.7244 21.3825 27.8739 28.4296
frequency: 21.2291 27.8018 28.3272 43.8997 56.9066 63.2857 82.8456 125.8405 145.4302 170.6491 180.0199 190.3428 225.2873 237.2690 261.0942 304.1840 336.5273 342.3754 373.3441 400.2902 403.1189 410.6232 415.5863 458.3173 459.9774 483.6609 495.1277 501.8941 519.2383 532.8853 570.6424 583.7358 607.2090 616.1220 623.2332 642.7043 665.5963 685.3002 696.2476 704.9623 710.7766 728.3636 744.9583 757.6187 775.3757 786.3602 797.8391 824.6575 832.3682 837.8125 841.0800 855.3955 869.2178 876.1650 885.1307 928.0968 951.8270 957.1955 971.0759 972.5526 980.9818 982.3532 988.5017 991.1529 998.1435 1004.0236 1020.0443 1033.3358 1035.1362 1059.2932 1071.7753 1085.0060 1106.7284 1120.2345 1150.1363 1168.4377 1171.9918 1178.1683 1179.9259 1187.3873 1194.4344 1214.0624 1225.6975 1234.8801 1242.6534 1276.3742 1284.2768 1292.7937 1314.6665 1323.4128 1343.5495 1363.8370 1372.5911 1383.6578 1389.5980 1405.1824 1422.0075 1432.8057 1437.3549 1450.4894 1456.9925 1478.1706 1481.6778 1517.8580 1579.0777 1586.4561 1593.6181 1602.6701 1604.8294 1611.4620 1630.1298 2987.4736 2988.7829 3120.2056 3121.3796 3128.5704 3130.1722 3131.6274 3140.1428 3147.8417 3149.7168 3151.7927 3162.8504 3163.1057 3164.1141 3166.1100 3173.1365 3187.1654 3459.1660
redmass: 5.8746 4.8470 3.9158 5.3393 5.1841 6.3699 6.9529 6.1220 4.9671 7.4467 4.7765 6.6150 4.3336 5.8194 5.8133 5.5621 5.5061 4.5937 6.1991 5.5865 2.8319 2.9629 3.5832 3.8917 4.3758 3.8100 6.0542 3.9859 6.1669 3.5720 3.6935 4.5064 2.3204 6.3568 7.1190 4.9437 3.8904 4.9911 4.5373 1.9010 2.9623 4.6535 2.4037 1.3188 3.3175 4.1171 2.6579 1.6196 2.8331 1.9897 1.3908 1.2598 4.0618 1.7737 3.2267 1.6118 1.3478 2.0291 1.9991 1.4289 1.3954 1.3837 1.3431 6.0114 1.3371 3.9593 3.2237 2.2114 2.3470 2.6305 2.6760 1.6463 1.4189 3.0644 1.2964 1.6787 1.0548 1.3029 1.1145 1.1386 1.8481 1.7402 2.2290 2.1315 1.5614 1.7506 1.3581 1.2985 1.5662 1.3731 1.4723 2.5990 5.5082 8.3456 3.6180 3.5307 3.9944 2.8345 2.6928 1.4212 2.1522 2.5765 2.2450 3.8418 8.3081 7.9832 6.2450 6.1508 6.2971 6.0452 6.6928 1.0838 1.0837 1.0865 1.0850 1.0874 1.0883 1.0882 1.0922 1.0941 1.0958 1.0886 1.0899 1.1003 1.1014 1.0963 1.0966 1.0959 1.0752
irintensity: 0.0838 0.1066 0.0911 0.0072 0.0872 0.1122 0.3543 0.2648 0.3918 0.0969 2.3891 1.7930 3.3382 0.7526 0.5720 1.3564 1.7599 11.7872 2.6519 3.7569 0.5128 0.2064 3.3333 6.6529 18.5165 16.3843 15.5149 4.1331 2.9102 0.5658 34.8816 6.4893 43.7850 0.2294 4.4976 8.4741 20.6615 2.1557 24.9964 47.9994 56.9176 33.0926 31.2645 47.3714 24.5604 9.6224 52.0351 51.5395 117.6268 93.1883 29.6633 0.9642 21.4927 3.1694 7.5291 8.2761 2.3262 41.2679 42.4134 5.5309 0.2340 5.0874 0.1774 1.8118 2.0916 35.0613 19.7378 1.9321 6.4726 32.9778 27.0336 4.3861 15.4877 10.6569 2.5176 5.6766 0.0080 7.7235 17.8816 6.4858 36.5964 16.9193 171.5232 31.4571 26.2861 19.8227 1.9000 6.1334 30.6321 10.1983 6.7891 0.6791 1.6906 0.6759 7.3994 19.1996 40.7387 12.3238 22.9131 16.5034 75.2465 78.4272 12.0219 34.8234 18.1824 4.0510 1.5909 30.5802 18.7975 4.1147 55.5011 6.0131 24.0796 3.8125 2.2613 0.7810 1.9691 12.5371 17.1585 40.4680 24.5216 1.9108 2.5175 32.2950 26.8761 8.4128 3.9719 1.7496 4.0906
temp: 298.150 k
press: 1.00000 atm
elementType: 17 8 7 6 6 6 6 6 6 6 6 6 6 6 6 6 6 6 6 6 6 6 6 6 6 6 6 1 1 1 1 1 1 1 1 1 1 1 1 1 1 1 1 1 1
symmnumber: 1
zpe: 918315.6 jmol-1
zpe.correction: 0.349768 hartree
zpe.thermalcorrener: 0.371046 hartree
zpe.thermalcorrenthalpy: 0.371991 hartree
zpe.thermalcorrgfe: 0.297285 hartree
zpe.sumelectzpe: -1513.553715 hartree
zpe.sumelectthermal: -1513.532436 hartree
zpe.sumelectthermalent: -1513.531492 hartree
zpe.sumelectthermalfe: -1513.606197 hartree
dipole: -2.6438 0.8637 -0.5596
dipole: 2.8370
quadrupole: -174.1233 -149.0355 -158.9637
quadrupole: 3.6507 -1.4154 -6.5450
quadrupole: -13.4158 11.6720 1.7438 3.6507 -1.4154 -6.5450
hfenergy: -1513.9034826 hartree
pointgroup: C01 [X(C24H18Cl1N1O1)]
dipole: 1.0496066 -0.3307508 -0.1863879 debye
polarizability: 392.6581043|7.0081354|280.3027635|3.4256387|32.501852|174.1375429 unknown
InChI: InChI=1S/C24H18ClNO/c25-19-13-10-18(11-14-19)24-26-23(17-7-2-1-3-8-17)22-20-9-5-4-6-16(20)12-15-21(22)27-24/h1-15,23-24,26H
charge 0 multiplicity 1
45 atoms
Cl -7.559849 0.537651 -0.503433
O  -0.915254 1.430965 0.611381
N  -0.795459 -0.373057 -1.062846
C  0.675514 -0.575175 -0.868945
C  1.298409 0.667681 -0.228695
C  -1.45451 0.082352 0.132928
C  0.469705 1.594153 0.435357
C  2.707126 0.95834 -0.347928
C  0.914174 -1.894834 -0.108826
C  3.23879 2.191139 0.199808
C  -2.956337 0.237819 -0.035789
C  0.992301 2.814615 0.973945
C  2.346059 3.102677 0.858522
C  3.621545 0.06229 -1.000247
C  1.550208 -1.942504 1.154009
C  0.467098 -3.105658 -0.698397
C  4.635161 2.480719 0.071165
C  -3.656465 1.346065 0.497435
C  -3.675962 -0.782035 -0.707951
C  4.980087 0.372416 -1.113549
C  5.496921 1.591497 -0.575871
C  1.735094 -3.177991 1.818469
C  0.652775 -4.339525 -0.04011
C  1.288803 -4.379137 1.224561
C  -5.059131 1.443705 0.356468
C  -5.077705 -0.698506 -0.855525
C  -5.747134 0.41793 -0.318402
H  1.094089 -0.696235 -1.887682
H  -1.208606 -0.621616 0.953038
H  -1.025531 0.195171 -1.888319
H  0.29558 3.495693 1.471782
H  2.747697 4.035048 1.272077
H  3.256951 -0.889181 -1.400834
H  1.906132 -1.0154 1.615944
H  -0.044197 -3.069132 -1.667715
H  5.018381 3.418776 0.490988
H  -3.100526 2.133193 1.01203
H  -3.131535 -1.638812 -1.117531
H  5.6584 -0.32784 -1.61373
H  6.563735 1.820851 -0.670302
H  2.227829 -3.200167 2.796981
H  0.303786 -5.267289 -0.507619
H  1.433819 -5.336015 1.738592
H  -5.603268 2.300589 0.763852
H  -5.634898 -1.483425 -1.374883
