program: Gaussian 09
title: 000282386
version: EM64L-G09RevD.01
frameworkgroup: C1[X(C24H17Cl2NO)]
method: RPBEPBE
basis: SDD
operation: Freq
keyword: #p
keyword: freq=noraman
keyword: PBEPBE/SDD
title: #p freq=noraman PBEPBE/SDD
converged: YES YES NO NO
title: Mulliken charges:
elementType: Cl Cl O N C C C C C C C C C C C C C C C C C C C C C C C C H H H H H H H H H H H H H H H H H
charge: -0.012628 -0.004324 -0.248311 -0.370420 -0.385616 0.160670 -0.234865 0.179731 0.192340 0.474539 0.416762 0.516170 -0.407427 -0.464358 -0.386492 -0.415073 -0.372612 -0.448037 -0.326738 -0.478782 -0.268333 -0.250869 -0.233508 -0.247404 -0.240537 -0.081824 -0.195560 -0.101484 0.265473 0.243057 0.295513 0.255243 0.241855 0.246642 0.233595 0.259425 0.241011 0.299789 0.249029 0.225978 0.228301 0.228376 0.229199 0.231462 0.261041
chargesum: 0.00000
title: Mulliken charges with hydrogens summed into heavy atoms:
elementType: Cl Cl O N C C C C C C C C C C C C C C C C C C C C C C C C
charge: -0.012628 -0.004324 -0.248311 -0.074907 -0.120143 0.160670 0.008192 0.179731 0.192340 0.474539 0.416762 0.516170 -0.152184 -0.222503 -0.139851 -0.181478 -0.113186 -0.207026 -0.026949 -0.229753 -0.042355 -0.022568 -0.005131 -0.018204 -0.009075 -0.081824 0.065481 -0.101484
polarizability: 3.98961052e+02 3.30195741e+00 2.82216815e+02 -1.26165685e+01 3.95077159e+00 2.05372589e+02
1716.lowfreq: -4.1442 -0.0021 -0.0013 -0.0005 1.8985 5.1544 14.1832 23.2123 33.8594
frequency: 14.1173 23.1873 33.8523 44.4051 51.8646 54.7317 95.8949 113.9899 125.2300 150.5935 171.3776 174.3946 190.4151 200.9211 221.6416 237.0191 264.8875 313.7347 333.3533 349.2108 370.7394 401.1914 406.6186 417.4029 421.5148 425.2247 451.1793 468.4973 482.7783 493.5104 504.3555 523.5697 533.1530 566.3014 587.1041 603.2737 615.9066 637.0355 659.7102 659.8812 681.4554 702.1553 707.1859 711.7183 730.1509 756.2669 761.1987 784.2858 795.4661 820.3048 823.9877 832.5417 858.4384 862.0591 878.2262 890.5927 902.3964 904.6296 929.2207 952.6516 954.2811 971.7563 973.3156 980.9897 988.4075 989.6782 999.1032 1006.5243 1011.9904 1026.1496 1034.8041 1065.4683 1084.4755 1109.9898 1116.0037 1142.8221 1150.3491 1169.9999 1173.2428 1177.4963 1188.2851 1195.7862 1211.6236 1217.7216 1235.3479 1243.0878 1248.0334 1276.7565 1284.3598 1307.2291 1332.8400 1342.1259 1362.2707 1377.7080 1382.0612 1392.9258 1406.1078 1422.1320 1429.3948 1437.3755 1443.7916 1457.4757 1463.4056 1479.0321 1520.3678 1575.0898 1585.8741 1591.7896 1600.9886 1603.3848 1608.8882 1631.1500 2894.2360 2985.5404 3103.3884 3120.3615 3123.4920 3131.4204 3132.8852 3134.5964 3142.1478 3145.4139 3149.6054 3163.3067 3164.0733 3169.3663 3173.8521 3177.9980 3507.0596
redmass: 9.0536 7.7296 7.1708 6.2020 3.8950 4.8833 7.2518 6.1417 5.1876 6.5869 5.7390 5.7665 16.1873 6.7603 4.3128 5.9017 4.9737 4.6709 5.3572 4.2665 7.0899 2.9013 3.0552 3.7145 2.9873 8.1458 2.8084 4.1871 3.9534 6.2669 3.8517 5.7918 3.5929 3.7743 6.3566 4.8118 6.2897 5.2396 6.7744 4.9532 5.6692 4.9584 2.4662 2.3858 5.8058 1.3617 2.2397 2.8707 5.7860 2.0782 1.3951 2.0159 1.3530 3.0993 1.7283 2.4991 2.6219 4.6897 1.4794 1.3438 1.3747 5.3999 1.3948 1.4208 1.4179 4.4175 1.3566 4.9287 3.5342 2.2561 2.2152 2.5404 1.6818 2.3904 2.7343 1.4681 1.2942 1.8552 1.0565 1.3380 1.1272 1.9192 2.1189 1.8855 2.0849 1.4096 1.4131 1.6135 1.4044 1.2712 1.2688 2.4052 2.7672 6.7368 6.5841 2.0419 3.4415 2.3063 3.2905 2.2425 2.2251 2.5096 2.9897 2.2120 3.9306 7.5913 8.1937 6.2257 6.7068 6.1297 6.0374 6.7145 1.0825 1.0841 1.0883 1.0865 1.0858 1.0885 1.0885 1.0905 1.0901 1.0956 1.0939 1.1012 1.1001 1.0961 1.0952 1.0933 1.0764
irintensity: 0.1230 0.0823 0.1796 0.1112 0.0222 0.0905 0.4213 1.1077 1.3440 1.1882 0.8072 0.6878 0.1727 0.2077 7.6344 2.6649 2.5333 3.1949 5.4424 15.7770 5.7266 14.0786 4.7435 0.3124 54.0078 2.3945 42.0474 3.2242 20.4463 47.7867 6.8052 15.9767 0.2124 10.7661 8.4006 8.3615 0.8261 13.8976 9.8399 13.1285 2.0363 3.1032 29.5864 32.7728 18.8335 41.3107 30.4577 7.2975 3.2885 1.8609 44.4157 93.7761 0.5639 8.3037 3.4976 50.0288 9.8937 8.3439 1.8580 1.8893 0.9397 148.6726 6.1168 0.8821 0.1134 2.0272 0.1885 31.7602 2.8823 9.0680 1.4629 66.5997 19.4247 29.6992 24.1286 2.8372 2.9786 4.6125 0.6054 15.0263 1.2633 36.5057 189.7586 21.9523 21.4857 21.7939 8.0514 3.3824 15.5778 13.8290 2.9851 60.1846 17.8607 11.9541 0.8164 25.8648 7.4576 5.5711 140.0662 20.7855 37.1030 20.4215 32.9417 12.9855 28.3970 15.0553 14.8684 2.8439 13.8613 32.1034 5.2581 55.0201 46.8192 14.3176 9.7012 3.5115 1.7543 1.6638 14.8738 7.6129 4.8452 31.6635 33.9208 27.1569 32.2351 8.1416 1.4327 1.5369 4.2827
temp: 298.150 k
press: 1.00000 atm
elementType: 17 17 8 7 6 6 6 6 6 6 6 6 6 6 6 6 6 6 6 6 6 6 6 6 6 6 6 6 1 1 1 1 1 1 1 1 1 1 1 1 1 1 1 1 1
symmnumber: 1
zpe: 891688.7 jmol-1
zpe.correction: 0.339626 hartree
zpe.thermalcorrener: 0.362322 hartree
zpe.thermalcorrenthalpy: 0.363267 hartree
zpe.thermalcorrgfe: 0.285026 hartree
zpe.sumelectzpe: -1972.933421 hartree
zpe.sumelectthermal: -1972.910725 hartree
zpe.sumelectthermalent: -1972.909780 hartree
zpe.sumelectthermalfe: -1972.988021 hartree
dipole: -2.9618 3.4085 -0.5413
dipole: 4.5479
quadrupole: -185.7367 -162.7354 -168.7285
quadrupole: 6.6620 -4.4782 3.4623
quadrupole: -13.3365 9.6648 3.6717 6.6620 -4.4782 3.4623
hfenergy: -1973.2730469 hartree
pointgroup: C01 [X(C24H17Cl2N1O1)]
dipole: 1.1175259 -1.3647027 -0.3004635 debye
polarizability: 399.6669629|-0.5169025|282.3364625|6.0718055|-1.4518103|204.5470303 unknown
InChI: InChI=1S/C24H17Cl2NO/c25-19-12-10-17(14-20(19)26)24-27-23(16-7-2-1-3-8-16)22-18-9-5-4-6-15(18)11-13-21(22)28-24/h1-14,23-24,27H
charge 0 multiplicity 1
45 atoms
Cl -5.597396 2.048543 1.834617
Cl -7.388278 -0.015656 0.007705
O  -0.805728 1.327901 -0.791851
N  -0.655257 -0.315686 0.932977
C  0.827517 -0.478111 0.900322
C  1.410853 0.713423 0.143862
C  -1.255163 -0.032377 -0.361959
C  0.571816 1.557445 -0.603951
C  2.814109 1.040389 0.239789
C  1.239028 -1.863525 0.361421
C  3.319658 2.230849 -0.416054
C  -2.764669 -0.022432 -0.286718
C  1.06351 2.740635 -1.241827
C  2.409819 3.067018 -1.147584
C  3.744876 0.233239 0.978142
C  1.253186 -2.969288 1.251439
C  1.533405 -2.086932 -1.007265
C  4.709152 2.560939 -0.31393
C  -3.404778 0.876111 0.59941
C  -3.538242 -0.903336 -1.074906
C  5.096288 0.58139 1.062523
C  5.588903 1.754125 0.411645
C  1.538634 -4.271219 0.785656
C  1.816747 -3.389495 -1.477529
C  1.817063 -4.485846 -0.585077
C  -4.80844 0.883013 0.693991
C  -4.945932 -0.897168 -0.977161
C  -5.580548 -0.002382 -0.091345
H  1.16079 -0.411762 1.955044
H  -0.909958 -0.723049 -1.167802
H  -1.151495 -1.024288 1.482464
H  0.352119 3.358465 -1.797557
H  2.793175 3.970653 -1.635364
H  3.398729 -0.68012 1.471961
H  1.045152 -2.807938 2.318175
H  1.573454 -1.236178 -1.697368
H  5.072377 3.465643 -0.816418
H  -2.803749 1.566111 1.197664
H  -3.047623 -1.595322 -1.768111
H  5.786822 -0.052565 1.629869
H  6.650281 2.0145 0.484232
H  1.551853 -5.113358 1.486725
H  2.048077 -3.546921 -2.537108
H  2.043234 -5.493912 -0.949902
H  -5.554971 -1.574927 -1.581546
