program: Gaussian 09
title: 000282348
version: EM64L-G09RevD.01
frameworkgroup: C1[X(C2H3F3O2S2)]
method: RPBEPBE
basis: SDD
operation: Freq
keyword: #p
keyword: freq=noraman
keyword: PBEPBE/SDD
title: #p freq=noraman PBEPBE/SDD
converged: NO YES NO NO
title: Mulliken charges:
elementType: S S F F F O O C C H H H
charge: 0.915390 0.101132 -0.120883 -0.169502 -0.134066 -0.455472 -0.471651 -0.737412 0.165044 0.293596 0.304617 0.309209
chargesum: 0.00000
title: Mulliken charges with hydrogens summed into heavy atoms:
elementType: S S F F F O O C C
charge: 0.915390 0.101132 -0.120883 -0.169502 -0.134066 -0.455472 -0.471651 0.170009 0.165044
polarizability: 1.11695283e+02 8.72622546e+00 7.50009658e+01 1.11157834e+00 3.16950865e+00 6.03470567e+01
1716.lowfreq: -12.4449 -5.5777 -0.0019 -0.0017 0.0021 3.3489 35.0906 46.0237 81.7884
frequency: 34.3295 45.9944 81.7791 145.2864 151.4166 177.7546 179.9445 244.8169 286.7579 294.1550 323.8502 373.1720 411.9497 461.4490 470.7449 553.7614 651.7683 816.1940 915.2888 933.3992 978.6748 994.7636 1010.1364 1038.0710 1318.7247 1407.2030 1416.2874 3033.7906 3185.5075 3197.7542
redmass: 12.7564 10.8230 13.2501 4.1434 4.8401 1.8904 2.5976 4.3084 17.3385 12.1399 11.6295 13.6030 24.8454 18.0708 18.1899 8.8279 18.0260 15.2599 3.6094 9.1287 1.6288 3.8889 8.0343 1.9221 1.1251 1.0524 1.0537 1.0241 1.1082 1.1085
irintensity: 1.0966 3.0551 1.2406 4.6141 0.9809 1.3219 0.2456 0.3174 1.1812 18.5701 23.1230 69.3745 1.5953 1.8918 2.9055 18.4908 22.8018 64.1063 6.6134 276.8004 179.3156 248.7939 175.1587 55.8008 2.8603 14.6536 13.1107 1.0786 0.8906 1.7656
temp: 298.150 k
press: 1.00000 atm
elementType: 16 16 9 9 9 8 8 6 6 1 1 1
symmnumber: 1
zpe: 150339.0 jmol-1
zpe.correction: 0.057261 hartree
zpe.thermalcorrener: 0.068604 hartree
zpe.thermalcorrenthalpy: 0.069548 hartree
zpe.thermalcorrgfe: 0.018495 hartree
zpe.sumelectzpe: -1323.209538 hartree
zpe.sumelectthermal: -1323.198195 hartree
zpe.sumelectthermalent: -1323.197251 hartree
zpe.sumelectthermalfe: -1323.248304 hartree
dipole: -1.6757 -0.8587 4.2502
dipole: 4.6486
quadrupole: -70.4785 -68.7651 -65.4077
quadrupole: 5.6386 -8.0914 -3.3082
quadrupole: -2.2614 -0.5480 2.8094 5.6386 -8.0914 -3.3082
hfenergy: -1323.2667992 hartree
pointgroup: C01 [X(C2H3F3O2S2)]
dipole: -1.3001105 0.837426 -0.9763799 debye
dipolederiv: 1.5471113 0.129236 -0.2621398 -0.0171614 0.9946379 -0.0503477 -0.3607098 -0.1417886 1.1732216 -0.6382779 -0.16598 0.1167368 -0.2556013 -0.2762328 0.0752059 0.0556101 0.0066093 -0.2179218 -0.5212242 -0.0488152 -0.2133024 -0.1244518 -0.3396905 0.0322295 -0.4708192 -0.0203638 -0.6505875 -0.4754073 0.2143819 -0.0271065 -0.0097549 -0.8221756 0.0481542 -0.0734498 -0.0961207 -0.2466894 -0.8155435 -0.2228538 0.3048589 -0.4096873 -0.4002381 0.1809129 0.1877644 0.068025 -0.4178708 -0.4309933 0.0033301 0.0388458 0.0949736 -0.4264364 -0.0816323 0.1062545 0.0369778 -0.579276 -0.5976533 -0.1000193 0.0626125 -0.0921766 -0.5011987 0.0877547 -0.0510731 0.0119774 -0.4099568 -0.0951586 -0.0248135 0.0091111 -0.0796185 -0.066288 0.0049165 0.0953728 -0.0115413 -0.0809374 1.8667702 0.1621596 -0.0374666 0.7905961 1.6511341 -0.3037449 0.5684247 0.1064288 1.2233285 0.082295 0.0449513 -0.0047825 0.0480057 0.0446822 -0.0269714 -0.0068438 -0.020933 0.0268458 0.0268172 0.0202039 0.0398294 0.0667964 0.0867046 0.0234664 -0.0125177 0.0429911 0.0788835 0.0512644 -0.0117809 -0.0271966 -0.0119201 0.0551013 0.0100562 -0.038013 0.0177378 0.1009602 unknown
polarizability: 104.603801|10.936048|69.3959625|-16.851684|2.9443655|73.0435422 unknown
InChI: InChI=1S/CF3S.CH3O2S/c2-1(3,4)5;1-4(2)3/h;1H3
charge 0 multiplicity 1
12 atoms
S  -1.639982 -0.991506 0.295808
S  0.42432 -1.121556 -1.218349
F  1.855395 0.147724 0.757123
F  0.481378 1.498328 -0.424537
F  2.386481 0.692573 -1.378114
O  -1.227485 -0.471607 1.775817
O  -2.403127 -2.404685 0.070457
C  -2.608883 0.390599 -0.604252
C  1.320825 0.34734 -0.525882
H  -2.72292 0.044881 -1.640038
H  -3.56618 0.472459 -0.06969
H  -1.986623 1.290949 -0.521544
