program: Gaussian 09
title: 000282353
version: EM64L-G09RevD.01
frameworkgroup: C1[X(C9H8N4O2S)]
method: RPBEPBE
basis: SDD
operation: Freq
keyword: #p
keyword: freq=noraman
keyword: PBEPBE/SDD
title: #p freq=noraman PBEPBE/SDD
converged: YES YES NO NO
title: Mulliken charges:
elementType: S O O N N N N C C C C C C C C C H H H H H H H H
charge: 0.266679 -0.253791 -0.205517 -0.282458 -0.434615 0.043445 0.024755 0.026443 0.246939 0.281791 -0.723415 -0.132529 -0.200527 -0.252265 -0.123586 -0.504842 0.244552 0.248178 0.248148 0.362536 0.299488 0.297445 0.252219 0.270927
chargesum: 0.00000
title: Mulliken charges with hydrogens summed into heavy atoms:
elementType: S O O N N N N C C C C C C C C C
charge: 0.266679 -0.253791 -0.205517 -0.282458 -0.072080 0.043445 0.024755 0.026443 0.246939 0.281791 0.017463 -0.132529 0.098961 0.045180 0.128633 -0.233916
polarizability: 2.94509114e+02 -4.79778259e+00 1.69944004e+02 -5.04392544e-02 1.97818072e-02 6.05161183e+01
1716.lowfreq: -2.4710 -0.0018 -0.0014 -0.0009 3.7827 6.9269 27.0972 45.3358 66.1457
frequency: 27.0618 45.3304 66.1447 99.2505 101.7719 135.4274 155.7922 189.2482 217.5036 242.6004 300.2998 310.3699 352.9961 390.4226 412.1294 459.0851 468.5274 486.1993 510.1643 573.7911 581.2693 602.3407 629.4210 670.5344 698.4714 708.5109 715.4759 738.3701 768.9455 800.2834 828.0677 853.2823 910.8157 932.3463 982.8127 985.5847 1031.8697 1040.5477 1066.4305 1081.9744 1092.3911 1161.4526 1177.4841 1218.5566 1242.6413 1316.3327 1346.8677 1359.7128 1399.8676 1431.3039 1446.5356 1452.4015 1454.7118 1516.0044 1537.1161 1562.6950 1581.6607 1677.0872 2997.7310 3077.1160 3121.9604 3126.2926 3179.7848 3198.2417 3239.7730 3569.8339
redmass: 5.5541 8.0535 6.3626 5.2740 4.5815 1.1184 5.3062 5.0449 13.0498 3.8717 3.5573 4.0068 8.3863 10.5173 9.7177 6.1050 7.1276 11.3321 6.1640 8.1132 3.5008 5.9017 8.4144 2.0930 7.3657 1.1847 1.9904 6.8917 8.9627 5.4090 4.7658 1.2759 5.0429 1.3867 1.4446 2.0126 2.0415 1.4732 3.5666 1.8535 2.1560 2.2723 4.8805 6.7895 1.4616 6.0886 1.9274 2.5551 1.2749 1.4944 1.0442 2.9803 1.3690 8.4005 6.3188 5.3351 6.6507 7.5036 1.0369 1.0969 1.0916 1.1005 1.0899 1.0984 1.0999 1.0792
irintensity: 0.8518 2.5344 1.8254 0.5764 0.1246 0.6786 5.5405 0.6538 1.8435 15.1392 5.2005 1.5215 6.2326 19.5230 1.1149 4.0587 16.7753 40.8526 2.1264 5.1804 3.8872 13.7673 0.5937 39.0516 10.6082 64.5044 139.6645 10.3153 4.9288 18.5202 12.8475 13.5240 11.7549 0.7557 24.3057 8.1478 25.0532 4.1805 13.8833 13.6395 17.6087 4.0073 100.1873 115.9405 68.7893 8.0835 55.3951 16.8928 43.7448 12.0408 16.6957 100.3871 10.0258 114.0962 80.7467 25.9794 219.7315 301.3048 8.5522 10.2878 2.1906 9.8225 6.3278 2.5384 0.3924 102.1381
temp: 298.150 k
press: 1.00000 atm
elementType: 16 8 8 7 7 7 7 6 6 6 6 6 6 6 6 6 1 1 1 1 1 1 1 1
symmnumber: 1
zpe: 434585.5 jmol-1
zpe.correction: 0.165525 hartree
zpe.thermalcorrener: 0.179995 hartree
zpe.thermalcorrenthalpy: 0.180939 hartree
zpe.thermalcorrgfe: 0.122446 hartree
zpe.sumelectzpe: -1114.075735 hartree
zpe.sumelectthermal: -1114.061265 hartree
zpe.sumelectthermalent: -1114.060321 hartree
zpe.sumelectthermalfe: -1114.118814 hartree
dipole: -0.0668 -0.7040 0.0060
dipole: 0.7072
quadrupole: -73.6652 -104.4278 -101.1435
quadrupole: -1.5356 -0.0195 0.0076
quadrupole: 19.4136 -11.3489 -8.0647 -1.5356 -0.0195 0.0076
hfenergy: -1114.2412597 hartree
pointgroup: C01 [X(C9H8N4O2S1)]
dipole: 0.0023857 0.2604966 0.0977403 debye
dipolederiv: 0.1881473 0.117894 0.0417418 0.1001673 -0.2151753 -0.1365829 0.0355923 -0.136983 0.0993931 -0.3481135 -0.2790638 -0.1023641 0.3723785 -0.8722809 -0.2028931 0.1359912 -0.1817847 -0.4215737 -0.4756651 0.3852024 0.1451616 -0.0095429 -1.0762362 -0.2682068 0.0004557 -0.2807379 -0.4457512 -0.6623265 -0.1010243 -0.0183921 0.2531175 -0.8520775 -0.2957414 0.1112197 -0.2842512 -0.1743065 -0.660672 0.7589724 0.2890305 -0.0871711 -0.5685742 -0.0921 -0.0208982 -0.1188247 -0.3523653 -0.4112334 -0.4263403 -0.1472254 0.0046417 0.4765967 0.220851 0.010768 0.2345221 -0.0414013 -0.2748895 0.1429645 0.0555627 -0.825491 -0.2048867 0.0048042 -0.2992661 -0.0257201 -0.1476157 0.3038826 -0.5039723 -0.1942424 -0.2632426 0.0912329 0.0431716 -0.1061595 0.0508269 0.018391 0.3111297 0.3003921 0.1098255 -0.6199088 1.0131745 0.2819292 -0.2268157 0.2525605 0.3962932 1.1615523 -0.4900832 -0.205307 0.4944116 1.4853247 0.4057073 0.1555766 0.4366388 0.4897108 -0.0439768 0.0706298 0.0286229 0.1211436 -0.1665092 -0.0800844 0.0470583 -0.0786724 0.0113417 -0.7716345 0.1457633 0.0708773 0.6731884 0.2750809 0.1528525 0.2631802 0.1693529 -0.1469804 1.3543184 0.0479791 -0.0238313 0.1981145 0.0943448 0.0201443 0.0326074 0.0248159 0.0317494 0.3746951 0.1259456 0.0313885 -0.2576764 -0.1758703 -0.0190128 -0.1080591 -0.0308369 -0.1098025 -0.3104023 -0.1765705 -0.058741 -0.4271501 -0.1782568 -0.0022718 -0.1505173 -0.0101936 -0.1347201 -0.3385575 -0.220855 -0.0791078 0.223491 0.2398067 0.1926033 0.0820764 0.2061617 -0.2349892 -0.1052333 -0.0002247 0.0070245 -0.0824215 0.0871931 -0.0097729 -0.0230873 -0.0123597 0.1170811 0.0968526 -0.0134494 0.0539539 0.0148015 -0.0215086 0.0766253 0.0199438 0.0911232 0.0411145 0.0923314 0.0219121 -0.0579875 0.0221878 0.0882464 -0.0398197 -0.0135162 -0.0534252 -0.0643301 0.2214361 0.0938832 0.0384703 0.0817245 0.2484494 -0.0399728 0.0340069 -0.0402298 0.3347347 0.1435074 0.0079698 0.0049001 -0.0156761 0.0463501 -0.0574243 -0.0043429 -0.0582866 0.1830114 0.1231922 -0.0378749 -0.0117552 -0.0645237 0.0527968 -0.0492072 -0.0215841 -0.050012 0.1756141 0.0139741 0.0571091 0.0262531 0.1034791 0.032374 -0.0620874 0.0432485 -0.0606976 0.1706065 0.0176848 -0.027159 -0.003859 -0.0100427 0.1004045 -0.0435113 0.0025218 -0.0429866 0.2047946 unknown
polarizability: 294.2063846|7.9623086|157.2594224|-4.382673|35.1350061|73.5034288 unknown
InChI: InChI=1S/C9H8N4O2S/c1-6-8(14)13(9(15)12-11-6)10-5-7-3-2-4-16-7/h2-5,12H,1H3
charge 0 multiplicity 1
24 atoms
S  3.717138 1.802726 0.477501
O  -1.260192 1.916274 0.677109
O  -0.996422 -2.548434 -0.965571
N  -1.012226 -0.295038 -0.139917
N  -3.023243 -1.508374 -0.520981
N  -3.855663 -0.484866 -0.119764
N  0.388919 -0.370183 -0.213624
C  -3.266337 0.639953 0.273644
C  -1.793929 0.831662 0.297581
C  -1.617276 -1.538467 -0.576166
C  -4.127695 1.788203 0.721753
C  2.592536 0.453467 0.018537
C  1.160287 0.650632 0.135551
C  3.312176 -0.665906 -0.411464
C  4.732907 -0.480423 -0.385823
C  5.120453 0.778917 0.062297
H  -5.189513 1.506386 0.651843
H  -3.939773 2.682498 0.100976
H  -3.887521 2.073569 1.761625
H  -3.498181 -2.361851 -0.818743
H  0.782991 1.612843 0.500825
H  2.804985 -1.579366 -0.729368
H  5.449644 -1.247679 -0.687052
H  6.123532 1.18476 0.180428
