program: Gaussian 09
title: 000022407
version: EM64L-G09RevD.01
frameworkgroup: C1[X(C11H14N2O)]
method: RPBEPBE
basis: SDD
operation: Freq
keyword: #p
keyword: freq=noraman
keyword: PBEPBE/SDD
title: #p freq=noraman PBEPBE/SDD
converged: NO YES NO NO
title: Mulliken charges:
elementType: O N N C C C C C C C C C C C H H H H H H H H H H H H H H
charge: -0.293576 -0.220615 -0.292753 -0.090571 -0.245759 -0.513793 -0.382150 -0.468340 -0.430422 0.508481 -0.440871 0.127843 -0.147978 -0.345098 0.215327 0.229283 0.237692 0.221857 0.252451 0.258707 0.228628 0.189094 0.190132 0.232719 0.276363 0.233886 0.227858 0.241603
chargesum: 0.00000
title: Mulliken charges with hydrogens summed into heavy atoms:
elementType: O N N C C C C C C C C C C C
charge: -0.293576 -0.220615 -0.016390 0.124756 -0.016475 -0.054243 0.129008 -0.050617 -0.007571 0.508481 -0.206985 0.127843 0.079879 -0.103495
polarizability: 1.53401862e+02 1.16355042e+00 1.41854774e+02 7.82639602e+00 -2.28898734e+00 8.90047550e+01
1716.lowfreq: -5.4634 -0.0009 -0.0005 -0.0004 11.8354 21.0651 73.6573 84.5042 177.2404
frequency: 73.5939 84.3509 177.2337 209.5727 237.9825 268.6119 326.1390 341.7443 363.2240 408.8495 437.8438 470.6306 486.9759 502.1273 540.2982 588.5616 612.2802 641.7958 705.6363 729.6699 756.7218 787.8932 803.3638 848.8014 858.7093 861.6768 895.7966 913.7436 957.3457 965.1654 976.2107 997.7683 1024.4491 1056.7773 1084.7404 1094.3022 1096.2723 1118.7246 1126.5256 1157.5001 1188.7393 1197.6573 1210.8442 1218.9594 1231.8360 1257.5841 1264.4971 1300.9278 1309.7330 1336.3823 1342.4964 1347.2628 1357.7428 1382.4873 1398.6717 1430.1986 1443.6346 1463.3328 1467.1798 1480.1120 1483.4889 1547.2839 1560.2979 1644.7160 2837.3067 2844.9907 2988.5185 2999.6016 3017.3807 3027.1529 3035.1570 3044.5803 3051.0242 3057.0496 3132.7381 3165.2061 3182.6273 3504.3212
redmass: 3.4341 5.2325 3.2060 3.2688 3.8329 4.2424 2.8337 2.3889 3.1925 2.2008 2.4217 2.5098 3.2103 3.9228 4.8667 3.2467 4.0297 4.5573 3.9054 2.1865 4.0131 1.9531 3.3846 1.8491 2.2570 2.9196 2.4976 1.7385 1.8150 2.0456 1.3056 2.6277 2.9755 2.2765 1.7020 1.7150 1.8971 1.5732 1.5348 1.3980 2.4865 1.6639 1.5849 1.3372 1.4309 1.2540 1.2715 1.7480 1.5902 1.4141 1.5159 1.6376 1.5780 1.4406 2.0961 1.6745 1.3550 1.0979 1.0896 1.1014 1.4600 6.3795 7.3855 7.6171 1.0719 1.0701 1.0621 1.0664 1.0800 1.0855 1.0884 1.0900 1.1025 1.1005 1.0884 1.0935 1.0966 1.0762
irintensity: 0.0966 2.1845 6.0782 0.7993 0.7212 4.4496 6.8443 3.1946 1.5330 1.1609 33.7454 23.6360 1.5956 15.9778 20.9781 17.0443 6.0344 0.4876 0.5655 17.7523 2.9960 57.2208 16.0969 2.2146 1.2911 3.8563 6.1027 1.1072 5.2515 3.4246 0.8058 5.1262 0.3708 1.5029 6.1508 24.2191 11.8399 6.4909 23.3864 4.0306 12.2437 10.5307 1.1962 2.9134 7.1585 8.0127 9.9459 4.2266 16.2347 1.1687 1.6805 10.6720 13.8978 0.1919 1.7483 13.9843 7.3843 5.5827 8.9885 6.8479 11.4796 121.5839 165.8418 235.9254 59.9576 231.9118 26.6082 6.2481 56.2351 41.5299 43.7553 21.9270 29.9318 16.5185 19.3442 9.1066 7.8481 0.9635
temp: 298.150 k
press: 1.00000 atm
elementType: 8 7 7 6 6 6 6 6 6 6 6 6 6 6 1 1 1 1 1 1 1 1 1 1 1 1 1 1
symmnumber: 1
zpe: 618130.4 jmol-1
zpe.correction: 0.235433 hartree
zpe.thermalcorrener: 0.246319 hartree
zpe.thermalcorrenthalpy: 0.247263 hartree
zpe.thermalcorrgfe: 0.199183 hartree
zpe.sumelectzpe: -611.260836 hartree
zpe.sumelectthermal: -611.249950 hartree
zpe.sumelectthermalent: -611.249006 hartree
zpe.sumelectthermalfe: -611.297086 hartree
dipole: 4.8251 -3.5145 0.5258
dipole: 5.9924
quadrupole: -81.3584 -84.7300 -81.0141
quadrupole: 10.7511 -1.7175 1.9095
quadrupole: 1.0091 -2.3625 1.3534 10.7511 -1.7175 1.9095
hfenergy: -611.4962691 hartree
pointgroup: C01 [X(C11H14N2O1)]
dipole: 1.9036095 1.3798371 -0.1750003 debye
polarizability: 153.4735651|-1.0670191|141.9212065|-7.5194775|-1.4219707|88.86662 unknown
InChI: InChI=1S/C11H14N2O/c14-11-3-1-2-10-9-4-8(5-12-6-9)7-13(10)11/h1-3,8-9,12H,4-7H2
charge 0 multiplicity 1
28 atoms
O  -2.178444 -2.166719 0.204369
N  -0.60123 -0.465184 -0.195685
N  2.030828 0.174167 1.448567
C  1.829555 -1.167248 -0.61536
C  1.186028 1.237006 -0.622803
C  1.873127 0.130077 -1.456236
C  0.367351 -1.590866 -0.367536
C  2.621914 -0.94641 0.699408
C  1.986486 1.439466 0.703387
C  -0.260571 0.870641 -0.332233
C  -1.238789 1.854839 -0.179892
C  -1.949843 -0.914575 0.110185
C  -2.580365 1.481976 0.134716
C  -2.925467 0.143362 0.27895
H  2.320935 -1.991491 -1.167211
H  1.191581 2.197142 -1.169866
H  1.360319 -0.009394 -2.426297
H  2.921904 0.412758 -1.668983
H  -0.009637 -2.205328 -1.206696
H  0.281591 -2.227059 0.530995
H  2.580364 -1.857069 1.324451
H  3.695007 -0.770811 0.426475
H  3.0015 1.820348 0.41835
H  1.495716 2.20927 1.325077
H  2.351367 0.261045 2.417161
H  -0.956284 2.903307 -0.306446
H  -3.343887 2.258481 0.259197
H  -3.943859 -0.174029 0.518057
