program: Gaussian 09
title: 000282360
version: EM64L-G09RevD.01
frameworkgroup: C1[X(C15H17NO2)]
method: RPBEPBE
basis: SDD
operation: Freq
keyword: #p
keyword: freq=noraman
keyword: PBEPBE/SDD
title: #p freq=noraman PBEPBE/SDD
converged: YES YES NO NO
title: Mulliken charges:
elementType: O O N C C C C C C C C C C C C C C C H H H H H H H H H H H H H H H H H
charge: -0.274365 -0.246542 -0.482864 -0.209450 -0.535003 -0.427633 0.147193 -0.524348 0.180281 0.138026 0.209777 0.240490 -0.421051 -0.367823 -0.255599 -0.224434 -0.264701 -0.660094 0.242988 0.248625 0.217904 0.218157 0.226405 0.213286 0.271853 0.297622 0.230017 0.227461 0.216782 0.218206 0.221430 0.232323 0.213753 0.249891 0.231439
chargesum: 0.00000
title: Mulliken charges with hydrogens summed into heavy atoms:
elementType: O O N C C C C C C C C C C C C C C C
charge: -0.274365 -0.246542 -0.185243 0.033538 -0.068474 0.016929 0.147193 -0.039209 0.180281 0.138026 0.209777 0.240490 -0.191034 -0.140362 -0.038816 -0.006227 0.189052 0.034988
polarizability: 2.02316148e+02 -3.16270109e+01 1.65813014e+02 9.63445059e+00 2.07215859e+01 1.41348208e+02
1716.lowfreq: -12.4852 -0.0002 0.0002 0.0006 1.9413 5.5999 21.7556 26.5440 68.2374
frequency: 21.6071 26.3564 68.2075 82.9341 88.9689 139.1580 176.2441 183.9724 213.6293 241.7100 283.6211 312.5969 323.4621 324.1648 350.1359 380.6854 428.4284 457.7387 491.5404 500.0593 509.4008 543.7995 576.8886 593.7650 602.5075 632.1436 668.2949 707.7717 741.9615 746.1006 757.1053 798.2650 815.5934 818.0351 839.3933 847.3974 876.0028 886.8301 925.2697 941.8709 966.1231 972.0078 977.5487 1010.3377 1012.0889 1057.3462 1095.9970 1106.6765 1109.9540 1123.7477 1151.5018 1154.6832 1160.2414 1172.2312 1181.1141 1209.2261 1221.4123 1236.9686 1264.0787 1276.4823 1282.9954 1308.9928 1318.4280 1345.7400 1348.9744 1356.0991 1366.4848 1390.9053 1409.7771 1437.3877 1454.9420 1455.7263 1462.2467 1467.7027 1471.1045 1474.4598 1481.6221 1483.9216 1580.4710 1601.2413 1623.2829 1634.4569 2963.1766 2972.3083 2985.5190 2993.2980 3003.1590 3022.1389 3028.5681 3045.9715 3069.1427 3088.8998 3093.1349 3119.1383 3119.7448 3127.0946 3141.2960 3159.8487 3605.7141
redmass: 3.9384 3.4844 4.4016 5.3794 3.8157 4.8768 2.2574 3.9470 1.8907 1.6893 4.0735 3.1258 2.4090 3.2359 2.9894 4.5444 2.8804 4.0557 3.9242 1.2210 5.0260 3.6177 3.4321 4.5187 5.4243 3.8039 4.3420 4.9622 2.8075 1.3120 3.9400 1.9233 2.4232 1.9450 3.1585 1.4656 3.9409 2.5304 1.3935 2.1353 1.2993 3.6953 2.2492 2.2265 2.4698 2.1209 2.1975 1.9849 1.7160 2.2496 1.4519 1.6497 1.5029 1.6130 1.2552 1.2277 1.4802 2.3080 1.5874 1.1229 1.5511 1.8639 1.6604 1.6121 1.3262 1.4366 2.0249 1.2293 3.7476 2.7836 1.1266 1.1050 1.0444 1.1744 1.1759 4.6135 2.7089 1.0518 6.5807 6.5344 9.3471 6.6478 1.0685 1.0594 1.0781 1.0362 1.0725 1.0933 1.0593 1.0925 1.1017 1.0974 1.1034 1.1057 1.0846 1.0889 1.0950 1.1000 1.0803
irintensity: 0.6996 0.0727 1.7659 0.4627 1.4135 3.2167 2.4727 0.3610 6.4773 0.2525 0.8478 3.5006 4.9675 10.6845 3.7308 1.5846 6.2463 2.8106 10.9634 78.4892 2.3676 1.3609 5.3050 9.3256 2.4532 6.9770 1.1529 3.8533 7.4771 102.2444 3.5296 6.7015 5.5570 3.5495 2.6985 0.1289 3.0403 1.5638 4.9444 8.4971 0.0163 3.2026 6.0240 21.4804 37.1842 27.6416 49.4333 40.0081 8.4423 183.5309 8.6815 20.8168 42.0826 12.2487 9.7720 2.7888 5.9863 15.5170 1.8747 2.8294 3.3587 23.5848 9.5862 28.2748 6.3150 3.1769 14.8711 18.9325 15.9267 24.8214 9.0795 8.8401 14.1796 8.9945 9.4736 47.6622 3.5618 16.5640 0.7067 11.5224 122.9002 4.4530 34.5590 43.2361 26.1187 16.0686 41.8352 39.1175 39.1133 9.1301 30.1477 41.0029 0.3768 29.1989 2.3180 4.1883 39.0989 34.9090 44.7233
temp: 298.150 k
press: 1.00000 atm
elementType: 8 8 7 6 6 6 6 6 6 6 6 6 6 6 6 6 6 6 1 1 1 1 1 1 1 1 1 1 1 1 1 1 1 1 1
symmnumber: 1
zpe: 757705.7 jmol-1
zpe.correction: 0.288595 hartree
zpe.thermalcorrener: 0.304502 hartree
zpe.thermalcorrenthalpy: 0.305447 hartree
zpe.thermalcorrgfe: 0.244041 hartree
zpe.sumelectzpe: -785.709816 hartree
zpe.sumelectthermal: -785.693909 hartree
zpe.sumelectthermalent: -785.692965 hartree
zpe.sumelectthermalfe: -785.754370 hartree
dipole: 0.6982 -0.5070 -0.3615
dipole: 0.9356
quadrupole: -106.2238 -95.5218 -101.3391
quadrupole: 6.0239 8.6904 2.8217
quadrupole: -5.1956 5.5064 -0.3108 6.0239 8.6904 2.8217
hfenergy: -785.9984112 hartree
pointgroup: C01 [X(C15H17N1O2)]
dipole: -0.219796 0.2660006 -0.1281098 debye
polarizability: 186.7298454|-35.2176282|184.0491012|-15.8226581|-15.6430369|138.698423 unknown
InChI: InChI=1S/C15H17NO2/c1-2-18-15(17)10-7-8-14-12(9-10)11-5-3-4-6-13(11)16-14/h3-6,10,16H,2,7-9H2,1H3
charge 0 multiplicity 1
35 atoms
O  -3.323047 -0.466914 0.558104
O  -3.24029 1.34036 -0.907652
N  1.572385 1.167832 -1.0270
C  -1.992153 1.427993 1.244492
C  -0.857863 0.461662 1.709392
C  -1.418878 2.787738 0.762998
C  0.271562 0.456192 0.708662
C  -0.460207 2.645463 -0.452103
C  0.436915 1.456838 -0.248812
C  1.349373 -0.496939 0.528167
C  2.15354 -0.025136 -0.573741
C  -2.884854 0.800443 0.167815
C  1.718576 -1.7033 1.179095
C  3.29551 -0.719751 -1.025751
C  2.857591 -2.402323 0.730486
C  3.638039 -1.916125 -0.359409
C  -4.195297 -1.205377 -0.408463
C  -3.343509 -1.968374 -1.426824
H  -2.656086 1.607536 2.115229
H  -1.276311 -0.550852 1.849534
H  -0.498739 0.797877 2.703968
H  -0.871085 3.238589 1.612652
H  -2.245022 3.469035 0.493124
H  0.127811 3.578307 -0.566177
H  -1.062758 2.526414 -1.373655
H  1.909139 1.733154 -1.803345
H  1.128244 -2.086359 2.019541
H  3.898822 -0.351273 -1.863409
H  3.153289 -3.334844 1.224465
H  4.518661 -2.481197 -0.68533
H  -4.778731 -1.88243 0.235891
H  -4.862458 -0.478844 -0.904963
H  -3.997146 -2.577548 -2.078708
H  -2.775555 -1.269749 -2.063562
H  -2.632968 -2.643399 -0.919613
