program: Gaussian 09
title: 000282381
version: EM64L-G09RevD.01
frameworkgroup: C1[X(C27H25NO)]
method: RPBEPBE
basis: SDD
operation: Freq
keyword: #p
keyword: freq=noraman
keyword: PBEPBE/SDD
title: #p freq=noraman PBEPBE/SDD
converged: YES YES NO NO
title: Mulliken charges:
elementType: O N C C C C C C C C C C C C C C C C C C C C C C C C C C C H H H H H H H H H H H H H H H H H H H H H H H H H
charge: -0.246479 -0.374099 -0.383829 0.154981 -0.240636 0.181049 0.192065 0.476953 0.473426 0.417236 -0.408551 -0.465589 -0.489805 -0.357123 -0.388264 0.550280 -0.235936 -0.415906 -0.371471 -0.402870 -0.463486 -0.449724 -0.269838 -0.252654 -0.234165 -0.247401 -0.693562 -0.691108 -0.241725 0.261557 0.241262 0.295119 0.253429 0.239567 0.234534 0.266792 0.246459 0.209288 0.231754 0.259385 0.230188 0.232960 0.239371 0.224285 0.226401 0.226078 0.227475 0.210514 0.213203 0.226844 0.229510 0.212257 0.210629 0.229372
chargesum: 0.00000
title: Mulliken charges with hydrogens summed into heavy atoms:
elementType: O N C C C C C C C C C C C C C C C C C C C C C C C C C C C
charge: -0.246479 -0.078980 -0.122273 0.154981 0.000626 0.181049 0.192065 0.476953 0.473426 0.417236 -0.155122 -0.226022 -0.255271 -0.090332 -0.141806 0.550280 -0.026649 -0.184152 -0.112086 -0.172682 -0.230525 -0.210353 -0.045552 -0.026253 -0.008087 -0.019926 -0.043001 -0.038712 -0.012352
polarizability: 4.18253980e+02 -2.26437710e+00 2.96949402e+02 -1.03754729e+01 -9.83500363e+00 2.15049994e+02
1716.lowfreq: -5.5062 -0.0007 -0.0006 0.0009 2.6357 8.4434 22.5343 23.7980 32.9487
frequency: 22.4644 23.6725 32.9451 39.4310 45.7452 48.0552 55.3117 102.5135 109.2684 125.3975 154.8791 159.7766 184.8951 191.5879 207.4359 223.8341 236.4814 251.6535 264.3819 302.2836 316.4315 324.9516 345.9529 379.0846 403.1280 405.9301 413.5652 423.7481 439.0854 468.1692 481.0619 482.2640 503.7085 522.3497 533.9829 557.1108 573.3428 587.6374 598.3712 616.1287 631.3750 648.3483 661.3576 682.5806 705.6978 715.3497 733.2386 753.8840 756.5797 761.7533 782.8774 791.1367 816.3939 830.5677 841.6159 851.1003 854.2582 861.1299 873.5002 879.8619 888.4346 891.8367 916.2286 925.0732 951.8857 955.9885 959.0393 966.8016 972.9348 975.9623 977.3293 987.3274 989.4074 996.1514 1012.0575 1015.9231 1025.6780 1034.1373 1050.4949 1065.4956 1083.3382 1111.2910 1113.4886 1116.2571 1149.2969 1154.8371 1167.9038 1172.3877 1176.2633 1185.6697 1188.7259 1195.7356 1217.0094 1219.8473 1222.7842 1234.9528 1244.2799 1275.3021 1280.2842 1294.1225 1309.1927 1310.0263 1321.3997 1330.3337 1357.9577 1365.1193 1376.0072 1382.2563 1390.3151 1396.1466 1404.8753 1411.6706 1422.9813 1430.4095 1438.0807 1445.1378 1457.4005 1465.6978 1467.6974 1477.3958 1477.7168 1484.7032 1510.2207 1519.9090 1583.8966 1586.7291 1591.3803 1603.5636 1608.4960 1624.5407 1630.7236 2894.7355 2974.1369 2976.6721 2980.1046 2983.5368 3067.1788 3074.0949 3077.1422 3081.5165 3101.0328 3115.9960 3118.6743 3120.4097 3122.2097 3129.3220 3130.9051 3133.4303 3140.9482 3144.2934 3148.0136 3161.7439 3162.1738 3162.4513 3167.7006 3516.2328
redmass: 3.9513 4.3804 4.1856 4.0974 3.6570 3.6878 4.6264 4.4519 4.4951 4.6905 4.7648 4.3858 3.8488 3.2301 1.1258 3.9212 1.6195 2.0179 4.3240 3.0422 3.5004 3.7695 4.2433 2.4677 2.8474 2.9104 3.3896 3.5120 2.7577 3.4703 4.7021 4.2639 3.4973 6.3293 3.5656 3.0245 3.2186 5.0383 3.3987 6.2720 6.5924 4.4119 5.1858 5.4390 1.7378 4.7031 4.6736 2.4819 1.5159 2.6757 3.0896 4.7415 2.5713 1.7211 1.7715 1.2890 1.2676 3.1708 2.6572 2.2972 2.8631 4.9352 1.1837 1.5004 1.3438 1.4916 1.4786 4.3532 1.3768 1.3923 1.4064 1.3610 5.1795 1.3452 3.3134 3.0844 2.2402 2.2023 1.6141 2.3275 1.6780 1.7990 2.4960 2.5831 1.2923 1.7530 1.8808 1.0638 1.2997 1.1385 1.1224 1.9725 2.1630 1.7875 2.0440 2.1280 1.4376 1.5584 1.4573 1.6558 1.3252 1.2881 1.7443 1.2695 1.7119 2.3235 1.1934 6.8132 2.5186 1.5180 3.4891 2.0161 2.8271 3.4191 2.1602 2.1649 2.4732 1.0483 1.0476 1.0502 2.2159 1.0951 2.5754 3.9150 8.2774 6.4898 6.1689 6.1155 6.0735 6.4265 6.7453 1.0825 1.0348 1.0355 1.0841 1.0841 1.1000 1.0992 1.1005 1.0997 1.0885 1.0872 1.0863 1.0893 1.0857 1.0886 1.0884 1.0904 1.0958 1.0956 1.0939 1.0952 1.1012 1.1002 1.0961 1.0766
irintensity: 0.0105 0.1880 0.3306 0.0670 0.0404 0.0757 0.1521 0.1073 0.0065 1.6379 1.0711 1.6670 0.9211 1.5468 0.1615 8.1956 1.8680 0.2689 2.7028 2.1436 3.7267 8.2543 0.5170 70.9182 0.1837 0.2031 0.8607 8.5636 37.0894 5.8184 12.7915 10.8352 12.9099 11.1013 0.0708 22.8065 12.0614 15.1380 11.3156 0.7253 3.2900 4.0143 6.3396 1.6143 44.6321 6.6933 13.7001 25.1978 38.8306 14.6581 8.5105 3.8802 2.3897 72.1182 61.1134 3.0649 1.9669 19.3427 18.6694 8.3919 1.9284 39.3615 3.0843 1.5923 2.0383 0.7480 14.4654 128.6743 2.7316 1.0097 0.0881 0.1378 1.3032 0.3653 12.0556 1.4881 9.5449 2.1485 67.7627 39.6095 20.5856 10.5684 7.6755 22.0107 3.1563 1.2193 5.3729 1.8069 14.2044 2.7626 18.5632 40.3633 149.3322 3.2613 4.7951 24.6697 24.5290 3.1784 12.0741 0.7365 1.5536 19.8006 40.7641 3.5108 3.3944 23.9079 15.3656 0.9402 11.2251 4.5576 12.5457 16.9978 1.6145 133.2554 16.7732 35.9955 26.6806 5.7633 0.2285 14.7660 14.2324 12.0114 9.2585 30.3029 20.9556 0.6366 2.5849 36.0026 5.8259 12.2818 62.5284 46.4448 30.7594 41.4591 18.0012 16.5527 0.3805 112.7434 23.8363 41.0664 10.3355 14.1635 3.5135 24.0610 1.3160 1.8840 16.4528 8.1662 21.1227 33.0380 35.3470 3.5437 27.7572 36.1637 9.3835 4.5851
temp: 298.150 k
press: 1.00000 atm
elementType: 8 7 6 6 6 6 6 6 6 6 6 6 6 6 6 6 6 6 6 6 6 6 6 6 6 6 6 6 6 1 1 1 1 1 1 1 1 1 1 1 1 1 1 1 1 1 1 1 1 1 1 1 1 1
symmnumber: 1
zpe: 1159296.4 jmol-1
zpe.correction: 0.441553 hartree
zpe.thermalcorrener: 0.466226 hartree
zpe.thermalcorrenthalpy: 0.467170 hartree
zpe.thermalcorrgfe: 0.385342 hartree
zpe.sumelectzpe: -1171.834193 hartree
zpe.sumelectthermal: -1171.809520 hartree
zpe.sumelectthermalent: -1171.808576 hartree
zpe.sumelectthermalfe: -1171.890404 hartree
dipole: -1.3411 2.2515 -0.3565
dipole: 2.6448
quadrupole: -153.4191 -159.8615 -165.0836
quadrupole: -0.3309 1.8319 -2.0019
quadrupole: 6.0356 -0.4068 -5.6289 -0.3309 1.8319 -2.0019
hfenergy: -1172.2757459 hartree
pointgroup: C01 [X(C27H25N1O1)]
dipole: -0.5125 -0.8926293 0.1525247 debye
polarizability: 418.1636345|4.4336413|296.7918655|10.2834933|-10.7383033|215.2978752 unknown
InChI: InChI=1S/C27H25NO/c1-18(2)19-12-14-22(15-13-19)27-28-26(21-9-4-3-5-10-21)25-23-11-7-6-8-20(23)16-17-24(25)29-27/h3-18,26-28H,1-2H3
charge 0 multiplicity 1
54 atoms
O  -0.388073 1.525565 -0.603088
N  -0.275454 -0.235041 1.007667
C  1.188902 -0.485805 0.903464
C  1.816735 0.721552 0.210377
C  -0.913683 0.165445 -0.235721
C  1.001419 1.662727 -0.444424
C  3.238032 0.963819 0.280725
C  1.492984 -1.850585 0.249844
C  -2.414595 0.254987 -0.093947
C  3.791089 2.171493 -0.301354
C  1.543413 2.862013 -1.010289
C  2.907951 3.107925 -0.938353
C  -3.265044 -0.537688 -0.899536
C  -2.985681 1.121095 0.869117
C  4.143756 0.052728 0.923782
C  -5.250955 0.388627 0.223893
C  -6.770124 0.467264 0.399566
C  1.464425 -3.018922 1.055735
C  1.724972 -1.989594 -1.14182
C  -4.665387 -0.473778 -0.739939
C  -4.387087 1.184023 1.020941
C  5.199261 2.417368 -0.221014
C  5.514652 0.319726 0.988844
C  6.05338 1.511181 0.412612
C  1.645465 -4.298023 0.48604
C  1.903545 -3.268784 -1.716299
C  -7.36861 -0.898977 0.829297
C  -7.466136 0.99478 -0.883879
C  1.861143 -4.426929 -0.906653
H  1.566606 -0.519668 1.944788
H  -0.639132 -0.486356 -1.09895
H  -0.800556 -0.928361 1.548367
H  0.851296 3.557136 -1.494768
H  3.326906 4.023767 -1.371335
H  -2.82933 -1.206374 -1.652378
H  -2.325012 1.743984 1.480576
H  3.760845 -0.876826 1.356638
H  -6.973804 1.192862 1.212871
H  1.303016 -2.924831 2.138527
H  1.796442 -1.093517 -1.769019
H  -5.306951 -1.098731 -1.372268
H  -4.82171 1.861692 1.766327
H  5.59802 3.336927 -0.666654
H  6.184911 -0.393108 1.482312
H  7.129505 1.707602 0.469218
H  1.625895 -5.189613 1.123119
H  2.085667 -3.360703 -2.793151
H  -7.208121 -1.666295 0.049188
H  -8.458352 -0.81009 0.995526
H  -6.903691 -1.264102 1.762722
H  -7.065986 1.981375 -1.178691
H  -8.55538 1.095547 -0.721071
H  -7.314418 0.301393 -1.732029
H  2.00534 -5.417403 -1.352653
